{"text_format":"1","workbook":"xlsx","n_sheets":15,"sheets":["ETAPA I","ETAPA II.ab","ETAPA II.c","ETAPA II.d","ETAPA II.e","ETAPA II.fg","ETAPA II.h","ETAPA II.i","ETAPA III.a","ETAPA III.a_","ETAPA III.b","ETAPA III.cd","ETAPA IV","ANEJO 1","TABLAS"],"not_rendered":{"charts":0,"images":8,"macros":1,"external_links":0,"defined_names":1,"comments":3,"pivot_tables":0},"unopened":[],"bounds":{"document_bytes":16777216,"sheet_cells":100000,"rows_first":2000,"rows_last":500,"rows_between":2000,"halvings":0,"cell_chars":16384,"cell_head_chars":4096},"cells_cut":0,"cells_raw":0,"read":"whole","date_system":"1900"}

{"sheet":"ETAPA I","index":0,"n_rows":187,"n_cols":6,"rows_kept":187,"cut":false,"hidden":false,"merged":[[183,0,183,5],[184,0,184,5],[185,2,185,5],[187,0,235,5],[2,2,2,5],[10,0,10,5],[46,4,46,5],[59,4,59,5],[5,1,5,5],[72,4,72,5],[130,0,130,5],[131,0,131,5],[132,3,132,5],[134,0,182,5],[25,0,25,5],[75,0,75,5],[22,1,22,5],[27,0,27,2],[28,0,28,5],[31,0,31,2],[76,0,76,5],[77,2,77,5],[84,0,128,5],[32,0,32,5],[29,0,29,5],[33,0,33,5],[80,0,80,5],[81,0,81,5]]}
[null,null,null,null,null,{"$f":"TABLAS!$AL$2","v":"BASES PARA LA ELABORACIÓN DE UNA ESTRATEGIA DE REHABILITACIÓN DEL ENTORNO CONSTRUIDO"}]
[null,null,null,null,null,{"$f":"TABLAS!$AL$3","v":"ETAPA I: IDENTIFICACIÓN DEL ÁMBITO"}]
[null,null,{"$f":"TABLAS!$AL$4","v":""}]
["I.a Identificación  y alcance ",null,null,null,"Fecha de redacción"]
[]
["Denominación:"]
[]
["Ámbito geográfico:",null,"Nº de hab. afect.:",{"$f":"IF(F39+F52+F65=0,\"\",F39+F52+F65)","v":""},"Superficie afectada km2:",{"$f":"IF(F41+F54+F67=0,\"\",F41+F54+F67)","v":""}]
[]
["Descripción del ámbito:"]
[]
[]
["Otras Estrategias de ámbito y/o enfoque temporal más amplio que contemple el área analizado en las presentes bases estratégicas:"]
[]
["  Agenda Urbana Valenciana:"]
[]
["  EDUSI:"]
[]
["  PUAM:"]
[]
["  Plan Estratégico Municipal:"]
[]
["  Otros (especificar):"]
[]
["Ayudas públicas concedidas que afecten al área de estudio: "]
[]
[]
["¿El/Los municipio/s implicados tiene/n experiencia en gestión de fondos europeos?"]
["  En caso afirmativo, especificar cuál/es:"]
[]
[]
["¿El área presenta algún tipo o Grado de protección?: "]
["  En caso afirmativo, especificar cuál:"]
[]
[]
["I.b  Datos de los municipios implicados"]
[]
["Municipio 1"]
["Denominación:",null,"  Nº de habitantes:",{"$f":"IFERROR(VLOOKUP('ETAPA I'!$B$39,TABLAS!H:U,5,FALSE),\"\")","v":""},"  Nº de habitantes afectados:"]
[]
["Provincia:",{"$f":"IFERROR(VLOOKUP('ETAPA I'!$B$39,TABLAS!H:U,3,FALSE),\"\")","v":""},"  Superficie km2:",{"$f":"IFERROR(VLOOKUP('ETAPA I'!$B$39,TABLAS!H:U,14,FALSE),\"\")","v":""},"  Superficie afectada km2:"]
[]
["Comarca:",{"$f":"IFERROR(VLOOKUP('ETAPA I'!$B$39,TABLAS!H:U,4,FALSE),\"\")","v":""},"  Zona  ATPMS:",{"$f":"IFERROR(VLOOKUP('ETAPA I'!$B$39,TABLAS!H:U,13,FALSE),\"\")","v":""}]
[]
["Código INE:",{"$f":"IFERROR(VLOOKUP('ETAPA I'!$B$39,TABLAS!H:U,2,FALSE),\"\")","v":""}]
[]
["Planeamiento vigente:",null,"  En desarrollo o revisión:"]
[]
["Fecha de aprobación:"]
[]
["Municipio 2"]
["Denominación:",null,"  Nº de habitantes:",{"$f":"IFERROR(VLOOKUP('ETAPA I'!$B$52,TABLAS!H:U,5,FALSE),\"\")","v":""},"  Nº de habitantes afectados:"]
[]
["Provincia:",{"$f":"IFERROR(VLOOKUP('ETAPA I'!$B$52,TABLAS!H:U,3,FALSE),\"\")","v":""},"  Superficie km2:",{"$f":"IFERROR(VLOOKUP('ETAPA I'!$B$52,TABLAS!H:U,14,FALSE),\"\")","v":""},"  Superficie afectada km2:"]
[]
["Comarca:",{"$f":"IFERROR(VLOOKUP('ETAPA I'!$B$52,TABLAS!H:U,4,FALSE),\"\")","v":""},"  Zona  ATPMS:",{"$f":"IFERROR(VLOOKUP('ETAPA I'!$B$52,TABLAS!H:U,13,FALSE),\"\")","v":""}]
[]
["Código INE:",{"$f":"IFERROR(VLOOKUP('ETAPA I'!$B$52,TABLAS!H:U,2,FALSE),\"\")","v":""}]
[]
["Planeamiento vigente:",null,"  En desarrollo o revisión:"]
[]
["Fecha de aprobación:"]
[]
["Municipio 3"]
["Denominación:",null,"  Nº de habitantes:",{"$f":"IFERROR(VLOOKUP('ETAPA I'!$B$65,TABLAS!H:U,5,FALSE),\"\")","v":""},"  Nº de habitantes afectados:"]
[]
["Provincia:",{"$f":"IFERROR(VLOOKUP('ETAPA I'!$B$65,TABLAS!H:U,3,FALSE),\"\")","v":""},"  Superficie km2:",{"$f":"IFERROR(VLOOKUP('ETAPA I'!$B$65,TABLAS!H:U,14,FALSE),\"\")","v":""},"  Superficie afectada km2:"]
[]
["Comarca:",{"$f":"IFERROR(VLOOKUP('ETAPA I'!$B$65,TABLAS!H:U,4,FALSE),\"\")","v":""},"  Zona  ATPMS:",{"$f":"IFERROR(VLOOKUP('ETAPA I'!$B$65,TABLAS!H:U,13,FALSE),\"\")","v":""}]
[]
["Código INE:",{"$f":"IFERROR(VLOOKUP('ETAPA I'!$B$65,TABLAS!H:U,2,FALSE),\"\")","v":""}]
[]
["Planeamiento vigente:",null,"  En desarrollo o revisión:"]
[]
["Fecha de aprobación:"]
[{"$f":"TABLAS!$AL$2","v":"BASES PARA LA ELABORACIÓN DE UNA ESTRATEGIA DE REHABILITACIÓN DEL ENTORNO CONSTRUIDO"}]
[{"$f":"TABLAS!$AL$3","v":"ETAPA I: IDENTIFICACIÓN DEL ÁMBITO"}]
[null,null,{"$f":"TABLAS!$AL$4","v":""}]
["I.c  Conclusiones extraídas del proceso participativo"]
[]
["¿Se ha alcanzado un elevado grado de consenso con las diferentes administraciones actuantes, así como con los sectores involucrados de la sociedad civil (asociaciones vecinales y ciudadanas, banca, empresas del sector, etc.) para el desarrollo de las actuaciones?"]
[]
[]
["Conclusiones:"]
[]
[]
[]
[]
[]
[]
[]
[]
[]
[]
[]
[]
[]
[]
[]
[]
[]
[]
[]
[]
[]
[]
[]
[]
[]
[]
[]
[]
[]
[]
[]
[]
[]
[]
[]
[]
[]
[]
[]
[]
[]
[]
[]
[]
[]
[]
[{"$f":"TABLAS!$AL$2","v":"BASES PARA LA ELABORACIÓN DE UNA ESTRATEGIA DE REHABILITACIÓN DEL ENTORNO CONSTRUIDO"}]
[{"$f":"TABLAS!$AL$3","v":"ETAPA I: IDENTIFICACIÓN DEL ÁMBITO"}]
[null,null,null,{"$f":"TABLAS!$AL$4","v":""}]
["I.d  Plano de emplazamiento"]
[]
[]
[]
[]
[]
[]
[]
[]
[]
[]
[]
[]
[]
[]
[]
[]
[]
[]
[]
[]
[]
[]
[]
[]
[]
[]
[]
[]
[]
[]
[]
[]
[]
[]
[]
[]
[]
[]
[]
[]
[]
[]
[]
[]
[]
[]
[]
[]
[]
[{"$f":"TABLAS!$AL$2","v":"BASES PARA LA ELABORACIÓN DE UNA ESTRATEGIA DE REHABILITACIÓN DEL ENTORNO CONSTRUIDO"}]
[{"$f":"TABLAS!$AL$3","v":"ETAPA I: IDENTIFICACIÓN DEL ÁMBITO"}]
[null,null,{"$f":"TABLAS!$AL$4","v":""}]
["I.e  Imágenes"]

{"sheet":"ETAPA II.ab","index":1,"n_rows":36,"n_cols":6,"rows_kept":36,"cut":false,"hidden":false,"merged":[[2,3,2,5],[36,0,45,5],[8,0,17,5]]}
[null,null,null,null,null,{"$f":"TABLAS!$AL$2","v":"BASES PARA LA ELABORACIÓN DE UNA ESTRATEGIA DE REHABILITACIÓN DEL ENTORNO CONSTRUIDO"}]
[null,null,null,null,null,{"$f":"TABLAS!$AL$5","v":"ETAPA II: ANÁLISIS Y DIAGNÓSTICO"}]
[null,null,null,{"$f":"TABLAS!$AL$4","v":""}]
["II.a  Espacios urbanos sensibles por municipio",null,null,null,null,"Visor de Espacios Urbanos Sensibles de la Comunitat Valenciana"]
["Municipio:",{"$f":"IF('ETAPA I'!B39=\"\",\"\",'ETAPA I'!B39)","v":""},null,{"$f":"IF('ETAPA I'!B52=\"\",\"\",'ETAPA I'!B52)","v":""},null,{"$f":"IF('ETAPA I'!B65=\"\",\"\",'ETAPA I'!B65)","v":""}]
["Tipología de vulnerabilidad:",{"$f":"IFERROR(VLOOKUP('ETAPA I'!$B$39,TABLAS!H:U,7,FALSE),\"\")","v":""},null,{"$f":"IFERROR(VLOOKUP('ETAPA I'!$B$52,TABLAS!H:U,7,FALSE),\"\")","v":""},null,{"$f":"IFERROR(VLOOKUP('ETAPA I'!$B$65,TABLAS!H:U,7,FALSE),\"\")","v":""}]
[]
["Observaciones:"]
[]
[]
[]
[]
[]
[]
[]
[]
[]
[]
[]
["II.b  Necesidad de vivienda y riesgo de despoblación por municipio",null,null,null,null,"ANHA Áreas de Necesidad de Vivienda"]
["Municipio:",{"$f":"IF('ETAPA I'!B39=\"\",\"\",'ETAPA I'!B39)","v":""},null,{"$f":"IF('ETAPA I'!B52=\"\",\"\",'ETAPA I'!B52)","v":""},null,{"$f":"IF('ETAPA I'!B65=\"\",\"\",'ETAPA I'!B65)","v":""}]
["Riesgo de despoblación:",{"$f":"IFERROR(VLOOKUP('ETAPA I'!$B$39,TABLAS!H:U,6,FALSE),\"\")","v":""},null,{"$f":"IFERROR(VLOOKUP('ETAPA I'!$B$52,TABLAS!H:U,6,FALSE),\"\")","v":""},null,{"$f":"IFERROR(VLOOKUP('ETAPA I'!$B$65,TABLAS!H:U,6,FALSE),\"\")","v":""}]
[]
["Necesidad de vivienda (ANHA ponderado):",{"$f":"IFERROR(VLOOKUP('ETAPA I'!$B$39,TABLAS!H:U,12,FALSE),\"\")","v":""},null,{"$f":"IFERROR(VLOOKUP('ETAPA I'!$B$52,TABLAS!H:U,12,FALSE),\"\")","v":""},null,{"$f":"IFERROR(VLOOKUP('ETAPA I'!$B$65,TABLAS!H:U,12,FALSE),\"\")","v":""}]
[]
["Nivel de Alquiler tensionado:",{"$f":"IFERROR(VLOOKUP('ETAPA I'!$B$39,TABLAS!H:U,11,FALSE),\"\")","v":""},null,{"$f":"IFERROR(VLOOKUP('ETAPA I'!$B$52,TABLAS!H:U,11,FALSE),\"\")","v":""},null,{"$f":"IFERROR(VLOOKUP('ETAPA I'!$B$65,TABLAS!H:U,11,FALSE),\"\")","v":""}]
[]
["Vulnerabilidad inundación:",{"$f":"IFERROR(VLOOKUP('ETAPA I'!$B$39,TABLAS!H:U,9,FALSE),\"\")","v":""},null,{"$f":"IFERROR(VLOOKUP('ETAPA I'!$B$52,TABLAS!H:U,9,FALSE),\"\")","v":""},null,{"$f":"IFERROR(VLOOKUP('ETAPA I'!$B$65,TABLAS!H:U,9,FALSE),\"\")","v":""}]
[]
[" Vulnerabilidad sismo:",{"$f":"IFERROR(VLOOKUP('ETAPA I'!$B$39,TABLAS!H:U,10,FALSE),\"\")","v":""},null,{"$f":"IFERROR(VLOOKUP('ETAPA I'!$B$52,TABLAS!H:U,10,FALSE),\"\")","v":""},null,{"$f":"IFERROR(VLOOKUP('ETAPA I'!$B$65,TABLAS!H:U,10,FALSE),\"\")","v":""}]
[]
["Titularidad de los edificios del área:"]
[]
["Índice medio de pobreza energética del área:"]
[]
["Observaciones:"]

{"sheet":"ETAPA II.c","index":2,"n_rows":358,"n_cols":10,"rows_kept":358,"cut":false,"hidden":false,"merged":[[358,1,388,9],[326,3,326,9],[318,5,318,9],[320,5,320,9],[322,5,322,9],[292,5,292,9],[298,5,298,9],[300,5,300,9],[302,5,302,9],[308,5,308,9],[295,3,295,5],[305,3,305,5],[315,3,315,5],[348,1,348,10],[261,3,261,5],[275,3,275,5],[285,3,285,5],[248,5,248,9],[254,5,254,9],[256,5,256,9],[258,5,258,9],[264,5,264,9],[266,5,266,9],[280,5,280,9],[282,5,282,9],[288,5,288,9],[290,5,290,9],[310,5,310,9],[312,5,312,9],[202,5,202,9],[204,5,204,9],[210,5,210,9],[278,5,278,9],[234,5,234,9],[236,5,236,9],[238,5,238,9],[244,5,244,9],[246,5,246,9],[231,3,231,5],[241,3,241,5],[221,3,221,5],[212,5,212,9],[214,5,214,9],[272,3,272,9],[268,5,268,9],[224,5,224,9],[226,5,226,9],[228,5,228,9],[251,3,251,5],[62,5,62,9],[64,5,64,9],[66,5,66,9],[146,5,146,9],[148,5,148,9],[150,5,150,9],[156,5,156,9],[99,3,99,5],[89,3,89,5],[190,5,190,9],[192,5,192,9],[158,5,158,9],[160,5,160,9],[170,5,170,9],[172,5,172,9],[174,5,174,9],[69,3,69,5],[79,3,79,5],[3,7,3,9],[35,3,35,5],[45,3,45,5],[59,3,59,5],[5,3,5,5],[15,3,15,5],[25,3,25,5],[8,5,8,9],[10,5,10,9],[12,5,12,9],[22,5,22,9],[28,5,28,9],[30,5,30,9],[32,5,32,9],[38,5,38,9],[194,5,194,9],[200,5,200,9],[84,5,84,9],[86,5,86,9],[92,5,92,9],[94,5,94,9],[96,5,96,9],[113,3,113,5],[104,5,104,9],[123,3,123,5],[180,5,180,9],[133,3,133,5],[143,3,143,5],[130,5,130,9],[136,5,136,9],[138,5,138,9],[140,5,140,9],[106,5,106,9],[116,5,116,9],[118,5,118,9],[120,5,120,9],[126,5,126,9],[182,5,182,9],[184,5,184,9],[2,3,2,9],[18,5,18,9],[20,5,20,9],[56,3,56,9],[110,3,110,9],[164,3,164,9],[218,3,218,9],[102,5,102,9],[153,3,153,5],[167,3,167,5],[177,3,177,5],[187,3,187,5],[197,3,197,5],[207,3,207,5],[72,5,72,9],[74,5,74,9],[40,5,40,9],[42,5,42,9],[48,5,48,9],[50,5,50,9],[52,5,52,9],[128,5,128,9],[76,5,76,9],[82,5,82,9]]}
[null,null,null,null,null,null,null,null,null,{"$f":"TABLAS!$AL$2","v":"BASES PARA LA ELABORACIÓN DE UNA ESTRATEGIA DE REHABILITACIÓN DEL ENTORNO CONSTRUIDO"}]
[null,null,null,null,null,null,null,null,null,{"$f":"TABLAS!$AL$5","v":"ETAPA II: ANÁLISIS Y DIAGNÓSTICO"}]
[null,null,null,{"$f":"TABLAS!$AL$4","v":""}]
["II.c  Estado del parque edificatorio municipal",null,null,null,null,"Nº de edificios:",null,5]
[null,"Edificio",null,"Dirección",null,null,null,"Superficie",null,"Año cons."]
["E.1"]
[null,"Evaluación del estado de conservación",null,"Evaluación de la accesibilidad",null,"Evaluación de la eficiencia energética "]
[null,"¿Se encuentra en uso?",null,"¿Presenta barreras arquitectónicas?",null,"Certificado de Eficiencia Energética del Edificio"]
[]
[null,"Nivel de mantenimiento",null,"Si existen, describir las barreras arquitectónicas",null,"Necesidad de mejorar la envolvente térmica"]
[]
[null,"Estado de consevación",null,"Si carece de ascensor, ¿es posible su instalación?",null,"Necesidad de actualizar las instalaciones térmicas"]
[]
[]
[null,"Edificio",null,"Dirección",null,null,null,"Superficie",null,"Año cons."]
["E.2"]
[null,"Evaluación del estado de conservación",null,"Evaluación de la accesibilidad",null,"Evaluación de la eficiencia energética "]
[null,"¿Se encuentra en uso?",null,"¿Presenta barreras arquitectónicas?",null,"Certificado de Eficiencia Energética del Edificio"]
[]
[null,"Nivel de mantenimiento",null,"Si existen, describir las barreras arquitectónicas",null,"Necesidad de mejorar la envolvente térmica"]
[]
[null,"Estado de consevación",null,"Si carece de ascensor, ¿es posible su instalación?",null,"Necesidad de actualizar las instalaciones térmicas"]
[]
[]
[null,"Edificio",null,"Dirección",null,null,null,"Superficie",null,"Año cons."]
["E.3"]
[null,"Evaluación del estado de conservación",null,"Evaluación de la accesibilidad",null,"Evaluación de la eficiencia energética "]
[null,"¿Se encuentra en uso?",null,"¿Presenta barreras arquitectónicas?",null,"Certificado de Eficiencia Energética del Edificio"]
[]
[null,"Nivel de mantenimiento",null,"Si existen, describir las barreras arquitectónicas",null,"Necesidad de mejorar la envolvente térmica"]
[]
[null,"Estado de consevación",null,"Si carece de ascensor, ¿es posible su instalación?",null,"Necesidad de actualizar las instalaciones térmicas"]
[]
[]
[null,"Edificio",null,"Dirección",null,null,null,"Superficie",null,"Año cons."]
["E.4"]
[null,"Evaluación del estado de conservación",null,"Evaluación de la accesibilidad",null,"Evaluación de la eficiencia energética "]
[null,"¿Se encuentra en uso?",null,"¿Presenta barreras arquitectónicas?",null,"Certificado de Eficiencia Energética del Edificio"]
[]
[null,"Nivel de mantenimiento",null,"Si existen, describir las barreras arquitectónicas",null,"Necesidad de mejorar la envolvente térmica"]
[]
[null,"Estado de consevación",null,"Si carece de ascensor, ¿es posible su instalación?",null,"Necesidad de actualizar las instalaciones térmicas"]
[]
[]
[null,"Edificio",null,"Dirección",null,null,null,"Superficie",null,"Año cons."]
["E.5"]
[null,"Evaluación del estado de conservación",null,"Evaluación de la accesibilidad",null,"Evaluación de la eficiencia energética "]
[null,"¿Se encuentra en uso?",null,"¿Presenta barreras arquitectónicas?",null,"Certificado de Eficiencia Energética del Edificio"]
[]
[null,"Nivel de mantenimiento",null,"Si existen, describir las barreras arquitectónicas",null,"Necesidad de mejorar la envolvente térmica"]
[]
[null,"Estado de consevación",null,"Si carece de ascensor, ¿es posible su instalación?",null,"Necesidad de actualizar las instalaciones térmicas"]
[]
[]
[null,null,null,null,null,null,null,null,null,{"$f":"TABLAS!$AL$2","v":"BASES PARA LA ELABORACIÓN DE UNA ESTRATEGIA DE REHABILITACIÓN DEL ENTORNO CONSTRUIDO"}]
[null,null,null,null,null,null,null,null,null,{"$f":"IF($J$2=\"\",\"\",$J$2)","v":"ETAPA II: ANÁLISIS Y DIAGNÓSTICO"}]
[null,null,null,{"$f":"TABLAS!$AL$4","v":""}]
[]
[null,"Edificio",null,"Dirección",null,null,null,"Superficie",null,"Año cons."]
["E.6"]
[null,"Evaluación del estado de conservación",null,"Evaluación de la accesibilidad",null,"Evaluación de la eficiencia energética "]
[null,"¿Se encuentra en uso?",null,"¿Presenta barreras arquitectónicas?",null,"Certificado de Eficiencia Energética del Edificio"]
[]
[null,"Nivel de mantenimiento",null,"Si existen, describir las barreras arquitectónicas",null,"Necesidad de mejorar la envolvente térmica"]
[]
[null,"Estado de consevación",null,"Si carece de ascensor, ¿es posible su instalación?",null,"Necesidad de actualizar las instalaciones térmicas"]
[]
[]
[null,"Edificio",null,"Dirección",null,null,null,"Superficie",null,"Año cons."]
["E.7"]
[null,"Evaluación del estado de conservación",null,"Evaluación de la accesibilidad",null,"Evaluación de la eficiencia energética "]
[null,"¿Se encuentra en uso?",null,"¿Presenta barreras arquitectónicas?",null,"Certificado de Eficiencia Energética del Edificio"]
[]
[null,"Nivel de mantenimiento",null,"Si existen, describir las barreras arquitectónicas",null,"Necesidad de mejorar la envolvente térmica"]
[]
[null,"Estado de consevación",null,"Si carece de ascensor, ¿es posible su instalación?",null,"Necesidad de actualizar las instalaciones térmicas"]
[]
[]
[null,"Edificio",null,"Dirección",null,null,null,"Superficie",null,"Año cons."]
["E.8"]
[null,"Evaluación del estado de conservación",null,"Evaluación de la accesibilidad",null,"Evaluación de la eficiencia energética "]
[null,"¿Se encuentra en uso?",null,"¿Presenta barreras arquitectónicas?",null,"Certificado de Eficiencia Energética del Edificio"]
[]
[null,"Nivel de mantenimiento",null,"Si existen, describir las barreras arquitectónicas",null,"Necesidad de mejorar la envolvente térmica"]
[]
[null,"Estado de consevación",null,"Si carece de ascensor, ¿es posible su instalación?",null,"Necesidad de actualizar las instalaciones térmicas"]
[]
[]
[null,"Edificio",null,"Dirección",null,null,null,"Superficie",null,"Año cons."]
["E.9"]
[null,"Evaluación del estado de conservación",null,"Evaluación de la accesibilidad",null,"Evaluación de la eficiencia energética "]
[null,"¿Se encuentra en uso?",null,"¿Presenta barreras arquitectónicas?",null,"Certificado de Eficiencia Energética del Edificio"]
[]
[null,"Nivel de mantenimiento",null,"Si existen, describir las barreras arquitectónicas",null,"Necesidad de mejorar la envolvente térmica"]
[]
[null,"Estado de consevación",null,"Si carece de ascensor, ¿es posible su instalación?",null,"Necesidad de actualizar las instalaciones térmicas"]
[]
[]
[null,"Edificio",null,"Dirección",null,null,null,"Superficie",null,"Año cons."]
["E.10"]
[null,"Evaluación del estado de conservación",null,"Evaluación de la accesibilidad",null,"Evaluación de la eficiencia energética "]
[null,"¿Se encuentra en uso?",null,"¿Presenta barreras arquitectónicas?",null,"Certificado de Eficiencia Energética del Edificio"]
[]
[null,"Nivel de mantenimiento",null,"Si existen, describir las barreras arquitectónicas",null,"Necesidad de mejorar la envolvente térmica"]
[]
[null,"Estado de consevación",null,"Si carece de ascensor, ¿es posible su instalación?",null,"Necesidad de actualizar las instalaciones térmicas"]
[]
[]
[null,null,null,null,null,null,null,null,null,{"$f":"TABLAS!$AL$2","v":"BASES PARA LA ELABORACIÓN DE UNA ESTRATEGIA DE REHABILITACIÓN DEL ENTORNO CONSTRUIDO"}]
[null,null,null,null,null,null,null,null,null,{"$f":"IF($J$2=\"\",\"\",$J$2)","v":"ETAPA II: ANÁLISIS Y DIAGNÓSTICO"}]
[null,null,null,{"$f":"TABLAS!$AL$4","v":""}]
[]
[null,"Edificio",null,"Dirección",null,null,null,"Superficie",null,"Año cons."]
["E.11"]
[null,"Evaluación del estado de conservación",null,"Evaluación de la accesibilidad",null,"Evaluación de la eficiencia energética "]
[null,"¿Se encuentra en uso?",null,"¿Presenta barreras arquitectónicas?",null,"Certificado de Eficiencia Energética del Edificio"]
[]
[null,"Nivel de mantenimiento",null,"Si existen, describir las barreras arquitectónicas",null,"Necesidad de mejorar la envolvente térmica"]
[]
[null,"Estado de consevación",null,"Si carece de ascensor, ¿es posible su instalación?",null,"Necesidad de actualizar las instalaciones térmicas"]
[]
[]
[null,"Edificio",null,"Dirección",null,null,null,"Superficie",null,"Año cons."]
["E.12"]
[null,"Evaluación del estado de conservación",null,"Evaluación de la accesibilidad",null,"Evaluación de la eficiencia energética "]
[null,"¿Se encuentra en uso?",null,"¿Presenta barreras arquitectónicas?",null,"Certificado de Eficiencia Energética del Edificio"]
[]
[null,"Nivel de mantenimiento",null,"Si existen, describir las barreras arquitectónicas",null,"Necesidad de mejorar la envolvente térmica"]
[]
[null,"Estado de consevación",null,"Si carece de ascensor, ¿es posible su instalación?",null,"Necesidad de actualizar las instalaciones térmicas"]
[]
[]
[null,"Edificio",null,"Dirección",null,null,null,"Superficie",null,"Año cons."]
["E.13"]
[null,"Evaluación del estado de conservación",null,"Evaluación de la accesibilidad",null,"Evaluación de la eficiencia energética "]
[null,"¿Se encuentra en uso?",null,"¿Presenta barreras arquitectónicas?",null,"Certificado de Eficiencia Energética del Edificio"]
[]
[null,"Nivel de mantenimiento",null,"Si existen, describir las barreras arquitectónicas",null,"Necesidad de mejorar la envolvente térmica"]
[]
[null,"Estado de consevación",null,"Si carece de ascensor, ¿es posible su instalación?",null,"Necesidad de actualizar las instalaciones térmicas"]
[]
[]
[null,"Edificio",null,"Dirección",null,null,null,"Superficie",null,"Año cons."]
["E.14"]
[null,"Evaluación del estado de conservación",null,"Evaluación de la accesibilidad",null,"Evaluación de la eficiencia energética "]
[null,"¿Se encuentra en uso?",null,"¿Presenta barreras arquitectónicas?",null,"Certificado de Eficiencia Energética del Edificio"]
[]
[null,"Nivel de mantenimiento",null,"Si existen, describir las barreras arquitectónicas",null,"Necesidad de mejorar la envolvente térmica"]
[]
[null,"Estado de consevación",null,"Si carece de ascensor, ¿es posible su instalación?",null,"Necesidad de actualizar las instalaciones térmicas"]
[]
[]
[null,"Edificio",null,"Dirección",null,null,null,"Superficie",null,"Año cons."]
["E.15"]
[null,"Evaluación del estado de conservación",null,"Evaluación de la accesibilidad",null,"Evaluación de la eficiencia energética "]
[null,"¿Se encuentra en uso?",null,"¿Presenta barreras arquitectónicas?",null,"Certificado de Eficiencia Energética del Edificio"]
[]
[null,"Nivel de mantenimiento",null,"Si existen, describir las barreras arquitectónicas",null,"Necesidad de mejorar la envolvente térmica"]
[]
[null,"Estado de consevación",null,"Si carece de ascensor, ¿es posible su instalación?",null,"Necesidad de actualizar las instalaciones térmicas"]
[]
[]
[null,null,null,null,null,null,null,null,null,{"$f":"TABLAS!$AL$2","v":"BASES PARA LA ELABORACIÓN DE UNA ESTRATEGIA DE REHABILITACIÓN DEL ENTORNO CONSTRUIDO"}]
[null,null,null,null,null,null,null,null,null,{"$f":"IF($J$2=\"\",\"\",$J$2)","v":"ETAPA II: ANÁLISIS Y DIAGNÓSTICO"}]
[null,null,null,{"$f":"TABLAS!$AL$4","v":""}]
[]
[null,"Edificio",null,"Dirección",null,null,null,"Superficie",null,"Año cons."]
["E.16"]
[null,"Evaluación del estado de conservación",null,"Evaluación de la accesibilidad",null,"Evaluación de la eficiencia energética "]
[null,"¿Se encuentra en uso?",null,"¿Presenta barreras arquitectónicas?",null,"Certificado de Eficiencia Energética del Edificio"]
[]
[null,"Nivel de mantenimiento",null,"Si existen, describir las barreras arquitectónicas",null,"Necesidad de mejorar la envolvente térmica"]
[]
[null,"Estado de consevación",null,"Si carece de ascensor, ¿es posible su instalación?",null,"Necesidad de actualizar las instalaciones térmicas"]
[]
[]
[null,"Edificio",null,"Dirección",null,null,null,"Superficie",null,"Año cons."]
["E.17"]
[null,"Evaluación del estado de conservación",null,"Evaluación de la accesibilidad",null,"Evaluación de la eficiencia energética "]
[null,"¿Se encuentra en uso?",null,"¿Presenta barreras arquitectónicas?",null,"Certificado de Eficiencia Energética del Edificio"]
[]
[null,"Nivel de mantenimiento",null,"Si existen, describir las barreras arquitectónicas",null,"Necesidad de mejorar la envolvente térmica"]
[]
[null,"Estado de consevación",null,"Si carece de ascensor, ¿es posible su instalación?",null,"Necesidad de actualizar las instalaciones térmicas"]
[]
[]
[null,"Edificio",null,"Dirección",null,null,null,"Superficie",null,"Año cons."]
["E.18"]
[null,"Evaluación del estado de conservación",null,"Evaluación de la accesibilidad",null,"Evaluación de la eficiencia energética "]
[null,"¿Se encuentra en uso?",null,"¿Presenta barreras arquitectónicas?",null,"Certificado de Eficiencia Energética del Edificio"]
[]
[null,"Nivel de mantenimiento",null,"Si existen, describir las barreras arquitectónicas",null,"Necesidad de mejorar la envolvente térmica"]
[]
[null,"Estado de consevación",null,"Si carece de ascensor, ¿es posible su instalación?",null,"Necesidad de actualizar las instalaciones térmicas"]
[]
[]
[null,"Edificio",null,"Dirección",null,null,null,"Superficie",null,"Año cons."]
["E.19"]
[null,"Evaluación del estado de conservación",null,"Evaluación de la accesibilidad",null,"Evaluación de la eficiencia energética "]
[null,"¿Se encuentra en uso?",null,"¿Presenta barreras arquitectónicas?",null,"Certificado de Eficiencia Energética del Edificio"]
[]
[null,"Nivel de mantenimiento",null,"Si existen, describir las barreras arquitectónicas",null,"Necesidad de mejorar la envolvente térmica"]
[]
[null,"Estado de consevación",null,"Si carece de ascensor, ¿es posible su instalación?",null,"Necesidad de actualizar las instalaciones térmicas"]
[]
[]
[null,"Edificio",null,"Dirección",null,null,null,"Superficie",null,"Año cons."]
["E.20"]
[null,"Evaluación del estado de conservación",null,"Evaluación de la accesibilidad",null,"Evaluación de la eficiencia energética "]
[null,"¿Se encuentra en uso?",null,"¿Presenta barreras arquitectónicas?",null,"Certificado de Eficiencia Energética del Edificio"]
[]
[null,"Nivel de mantenimiento",null,"Si existen, describir las barreras arquitectónicas",null,"Necesidad de mejorar la envolvente térmica"]
[]
[null,"Estado de consevación",null,"Si carece de ascensor, ¿es posible su instalación?",null,"Necesidad de actualizar las instalaciones térmicas"]
[]
[]
[null,null,null,null,null,null,null,null,null,{"$f":"TABLAS!$AL$2","v":"BASES PARA LA ELABORACIÓN DE UNA ESTRATEGIA DE REHABILITACIÓN DEL ENTORNO CONSTRUIDO"}]
[null,null,null,null,null,null,null,null,null,{"$f":"IF($J$2=\"\",\"\",$J$2)","v":"ETAPA II: ANÁLISIS Y DIAGNÓSTICO"}]
[null,null,null,{"$f":"TABLAS!$AL$4","v":""}]
[]
[null,"Edificio",null,"Dirección",null,null,null,"Superficie",null,"Año cons."]
["E.21"]
[null,"Evaluación del estado de conservación",null,"Evaluación de la accesibilidad",null,"Evaluación de la eficiencia energética "]
[null,"¿Se encuentra en uso?",null,"¿Presenta barreras arquitectónicas?",null,"Certificado de Eficiencia Energética del Edificio"]
[]
[null,"Nivel de mantenimiento",null,"Si existen, describir las barreras arquitectónicas",null,"Necesidad de mejorar la envolvente térmica"]
[]
[null,"Estado de consevación",null,"Si carece de ascensor, ¿es posible su instalación?",null,"Necesidad de actualizar las instalaciones térmicas"]
[]
[]
[null,"Edificio",null,"Dirección",null,null,null,"Superficie",null,"Año cons."]
["E.22"]
[null,"Evaluación del estado de conservación",null,"Evaluación de la accesibilidad",null,"Evaluación de la eficiencia energética "]
[null,"¿Se encuentra en uso?",null,"¿Presenta barreras arquitectónicas?",null,"Certificado de Eficiencia Energética del Edificio"]
[]
[null,"Nivel de mantenimiento",null,"Si existen, describir las barreras arquitectónicas",null,"Necesidad de mejorar la envolvente térmica"]
[]
[null,"Estado de consevación",null,"Si carece de ascensor, ¿es posible su instalación?",null,"Necesidad de actualizar las instalaciones térmicas"]
[]
[]
[null,"Edificio",null,"Dirección",null,null,null,"Superficie",null,"Año cons."]
["E.23"]
[null,"Evaluación del estado de conservación",null,"Evaluación de la accesibilidad",null,"Evaluación de la eficiencia energética "]
[null,"¿Se encuentra en uso?",null,"¿Presenta barreras arquitectónicas?",null,"Certificado de Eficiencia Energética del Edificio"]
[]
[null,"Nivel de mantenimiento",null,"Si existen, describir las barreras arquitectónicas",null,"Necesidad de mejorar la envolvente térmica"]
[]
[null,"Estado de consevación",null,"Si carece de ascensor, ¿es posible su instalación?",null,"Necesidad de actualizar las instalaciones térmicas"]
[]
[]
[null,"Edificio",null,"Dirección",null,null,null,"Superficie",null,"Año cons."]
["E.24"]
[null,"Evaluación del estado de conservación",null,"Evaluación de la accesibilidad",null,"Evaluación de la eficiencia energética "]
[null,"¿Se encuentra en uso?",null,"¿Presenta barreras arquitectónicas?",null,"Certificado de Eficiencia Energética del Edificio"]
[]
[null,"Nivel de mantenimiento",null,"Si existen, describir las barreras arquitectónicas",null,"Necesidad de mejorar la envolvente térmica"]
[]
[null,"Estado de consevación",null,"Si carece de ascensor, ¿es posible su instalación?",null,"Necesidad de actualizar las instalaciones térmicas"]
[]
[]
[null,"Edificio",null,"Dirección",null,null,null,"Superficie",null,"Año cons."]
["E.25"]
[null,"Evaluación del estado de conservación",null,"Evaluación de la accesibilidad",null,"Evaluación de la eficiencia energética "]
[null,"¿Se encuentra en uso?",null,"¿Presenta barreras arquitectónicas?",null,"Certificado de Eficiencia Energética del Edificio"]
[]
[null,"Nivel de mantenimiento",null,"Si existen, describir las barreras arquitectónicas",null,"Necesidad de mejorar la envolvente térmica"]
[]
[null,"Estado de consevación",null,"Si carece de ascensor, ¿es posible su instalación?",null,"Necesidad de actualizar las instalaciones térmicas"]
[]
[]
[null,null,null,null,null,null,null,null,null,{"$f":"TABLAS!$AL$2","v":"BASES PARA LA ELABORACIÓN DE UNA ESTRATEGIA DE REHABILITACIÓN DEL ENTORNO CONSTRUIDO"}]
[null,null,null,null,null,null,null,null,null,{"$f":"IF($J$2=\"\",\"\",$J$2)","v":"ETAPA II: ANÁLISIS Y DIAGNÓSTICO"}]
[null,null,null,{"$f":"TABLAS!$AL$4","v":""}]
[]
[null,"Edificio",null,"Dirección",null,null,null,"Superficie",null,"Año cons."]
["E.26"]
[null,"Evaluación del estado de conservación",null,"Evaluación de la accesibilidad",null,"Evaluación de la eficiencia energética "]
[null,"¿Se encuentra en uso?",null,"¿Presenta barreras arquitectónicas?",null,"Certificado de Eficiencia Energética del Edificio"]
[]
[null,"Nivel de mantenimiento",null,"Si existen, describir las barreras arquitectónicas",null,"Necesidad de mejorar la envolvente térmica"]
[]
[null,"Estado de consevación",null,"Si carece de ascensor, ¿es posible su instalación?",null,"Necesidad de actualizar las instalaciones térmicas"]
[]
[]
[null,"Edificio",null,"Dirección",null,null,null,"Superficie",null,"Año cons."]
["E.27"]
[null,"Evaluación del estado de conservación",null,"Evaluación de la accesibilidad",null,"Evaluación de la eficiencia energética "]
[null,"¿Se encuentra en uso?",null,"¿Presenta barreras arquitectónicas?",null,"Certificado de Eficiencia Energética del Edificio"]
[]
[null,"Nivel de mantenimiento",null,"Si existen, describir las barreras arquitectónicas",null,"Necesidad de mejorar la envolvente térmica"]
[]
[null,"Estado de consevación",null,"Si carece de ascensor, ¿es posible su instalación?",null,"Necesidad de actualizar las instalaciones térmicas"]
[]
[]
[null,"Edificio",null,"Dirección",null,null,null,"Superficie",null,"Año cons."]
["E.28"]
[null,"Evaluación del estado de conservación",null,"Evaluación de la accesibilidad",null,"Evaluación de la eficiencia energética "]
[null,"¿Se encuentra en uso?",null,"¿Presenta barreras arquitectónicas?",null,"Certificado de Eficiencia Energética del Edificio"]
[]
[null,"Nivel de mantenimiento",null,"Si existen, describir las barreras arquitectónicas",null,"Necesidad de mejorar la envolvente térmica"]
[]
[null,"Estado de consevación",null,"Si carece de ascensor, ¿es posible su instalación?",null,"Necesidad de actualizar las instalaciones térmicas"]
[]
[]
[null,"Edificio",null,"Dirección",null,null,null,"Superficie",null,"Año cons."]
["E.29"]
[null,"Evaluación del estado de conservación",null,"Evaluación de la accesibilidad",null,"Evaluación de la eficiencia energética "]
[null,"¿Se encuentra en uso?",null,"¿Presenta barreras arquitectónicas?",null,"Certificado de Eficiencia Energética del Edificio"]
[]
[null,"Nivel de mantenimiento",null,"Si existen, describir las barreras arquitectónicas",null,"Necesidad de mejorar la envolvente térmica"]
[]
[null,"Estado de consevación",null,"Si carece de ascensor, ¿es posible su instalación?",null,"Necesidad de actualizar las instalaciones térmicas"]
[]
[]
[null,"Edificio",null,"Dirección",null,null,null,"Superficie",null,"Año cons."]
["E.30"]
[null,"Evaluación del estado de conservación",null,"Evaluación de la accesibilidad",null,"Evaluación de la eficiencia energética "]
[null,"¿Se encuentra en uso?",null,"¿Presenta barreras arquitectónicas?",null,"Certificado de Eficiencia Energética del Edificio"]
[]
[null,"Nivel de mantenimiento",null,"Si existen, describir las barreras arquitectónicas",null,"Necesidad de mejorar la envolvente térmica"]
[]
[null,"Estado de consevación",null,"Si carece de ascensor, ¿es posible su instalación?",null,"Necesidad de actualizar las instalaciones térmicas"]
[]
[]
[null,null,null,null,null,null,null,null,null,{"$f":"TABLAS!$AL$2","v":"BASES PARA LA ELABORACIÓN DE UNA ESTRATEGIA DE REHABILITACIÓN DEL ENTORNO CONSTRUIDO"}]
[null,null,null,null,null,null,null,null,null,{"$f":"IF($J$2=\"\",\"\",$J$2)","v":"ETAPA II: ANÁLISIS Y DIAGNÓSTICO"}]
[null,null,null,{"$f":"TABLAS!$AL$4","v":""}]
[]
[null,"Datos de los edificios de viviendas municipales:"]
[]
[null,"Nº de edificios"]
[]
[null,"Tipología edificatoria mayoritaria:"]
[]
[null,"Antigüedad mayoritaria:"]
[]
[null,"Superficie total construida m²:"]
[]
[null,"Estado de conservación mayoritario:"]
[]
[null,"¿Existen edificios catalogados como BIC?"]
[]
[null,"Nº total de viviendas:"]
[]
[null,"Destinadas a alquiler asequible:"]
[]
[null,"Destinadas a alquiler social:"]
[]
[null,"Datos de edificios de viviendas de otras administraciones:"]
[null,"Nº de edificios"]
[]
[null,"Estado de conservación mayoritario:"]
[]
[null,"Nº total de viviendas:"]
[]
[null,"¿Existen edificios catalogados como BIC?"]
[]
[null,"Observaciones:"]

{"sheet":"ETAPA II.d","index":3,"n_rows":48,"n_cols":4,"rows_kept":48,"cut":false,"hidden":false,"merged":[[48,0,52,3]]}
[null,null,null,{"$f":"TABLAS!$AL$2","v":"BASES PARA LA ELABORACIÓN DE UNA ESTRATEGIA DE REHABILITACIÓN DEL ENTORNO CONSTRUIDO"}]
[null,null,null,{"$f":"TABLAS!$AL$5","v":"ETAPA II: ANÁLISIS Y DIAGNÓSTICO"}]
[null,null,null,{"$f":"TABLAS!$AL$4","v":""}]
["II.d Inventario de solares municipales"]
[]
["Identificación, ubicación","Calificación / Uso ","Superficie\nm2","Edificabilidad\nm2"]
[]
[]
[]
[]
[]
[]
[]
[]
[]
[]
[]
[]
[]
[]
[]
[]
[]
[]
[]
[]
[]
[]
[]
[]
[]
[]
[]
[]
[]
[]
[]
[]
[]
[]
[]
[]
[]
[]
[]
[]
[]
["Observaciones:"]

{"sheet":"ETAPA II.e","index":4,"n_rows":46,"n_cols":10,"rows_kept":46,"cut":false,"hidden":false,"merged":[[46,0,53,9],[2,4,2,9],[5,0,6,0],[5,1,6,1],[5,2,6,2],[5,3,5,9],[43,3,43,5]]}
[null,null,null,null,null,null,null,null,null,{"$f":"TABLAS!$AL$2","v":"BASES PARA LA ELABORACIÓN DE UNA ESTRATEGIA DE REHABILITACIÓN DEL ENTORNO CONSTRUIDO"}]
[null,null,null,null,null,null,null,null,null,{"$f":"TABLAS!$AL$5","v":"ETAPA II: ANÁLISIS Y DIAGNÓSTICO"}]
[null,null,null,null,{"$f":"TABLAS!$AL$4","v":""}]
["II.e  Estado de la urbanización del ámbito"]
[]
["Denominación del elemento urbano","Calidad del diseño ","Accesibilidad y Perspectiva de género","Estado de conservación"]
[null,null,null,"Red de saneamiento","Calzada","Pavimento peatonal","Mobiliario urbano","Vegetación","Alumbrado\nSeñalización","Telecomu-nicaciones"]
[]
[]
[]
[]
[]
[]
[]
[]
[]
[]
[]
[]
[]
[]
[]
[]
[]
[]
[]
[]
[]
[]
[]
[]
[]
[]
[]
[]
[]
[]
[]
[]
[]
[]
[]
[]
["Estado de conservación mayoritario de los espacios urbanos:"]
[]
["Observaciones:"]

{"sheet":"ETAPA II.fg","index":5,"n_rows":87,"n_cols":5,"rows_kept":87,"cut":false,"hidden":false,"merged":[[87,0,127,4],[2,2,2,4],[84,0,85,0],[15,3,17,3],[52,0,70,4],[73,2,73,4]]}
[null,null,null,null,{"$f":"TABLAS!$AL$2","v":"BASES PARA LA ELABORACIÓN DE UNA ESTRATEGIA DE REHABILITACIÓN DEL ENTORNO CONSTRUIDO"}]
[null,null,null,null,{"$f":"TABLAS!$AL$5","v":"ETAPA II: ANÁLISIS Y DIAGNÓSTICO"}]
[null,null,{"$f":"TABLAS!$AL$4","v":""}]
["II.f  Estado del parque privado residencial"]
[]
["Datos generales",null,null,"Edificios de viviendas sin IEE y solares residenciales:"]
[]
["Nº de edificios",null,null,"Nº de edificios en mal estado, en uso"]
[]
["Tipología edificatoria mayoritaria",null,null,"De los cuales tienen Orden de Ejecución"]
[]
["Antigüedad mayoritaria",null,null,"Nº de edificios ruinosos, en desuso"]
[]
["Superficie total construida m²",null,null,"De los cuales tienen Orden de Ejecución"]
[]
["Estado de conservación mayoritario",null,null,"Nº de solares (suelo con calificación “residencial”)"]
[]
["Nº total de viviendas"]
[]
["¿Hay edificios catalogados como BIC?"]
[]
["Información relativa al IEEv.CV"]
[]
["Nº de Edificios de más de 50 años",null,null,"Nº de Edificios de más de 50 años con IEEv.CV registrado"]
[]
["Nº de Viviendas de más de 50 años",null,null,"Nº de Viviendas de más de 50 años con IEEv.CV registrado"]
[]
[null,null,null,"Datos extraídos de los IEEv.CV registrados:"]
[]
[null,null,null,"Presentan riesgos inminentes"]
[]
[null,null,null,"Requieren intervenciones de conservación de carácter urgente"]
[]
[null,null,null,"Requieren intervenciones de conservación a medio plazo"]
[]
[null,null,null,"Presentan barreras arquitectónicas"]
[]
[null,null,null,"Con calificación energética A"]
[]
[null,null,null,"Con calificación energética B"]
[]
[null,null,null,"Con calificación energética C"]
[]
[null,null,null,"Con calificación energética D"]
[]
[null,null,null,"Con calificación energética E"]
[]
[null,null,null,"Con calificación energética F"]
[]
[null,null,null,"Con calificación energética G"]
[]
["Observaciones:"]
[]
[]
[]
[]
[]
[]
[]
[]
[]
[]
[]
[]
[]
[]
[]
[]
[]
[]
[]
[null,null,null,null,{"$f":"TABLAS!$AL$2","v":"BASES PARA LA ELABORACIÓN DE UNA ESTRATEGIA DE REHABILITACIÓN DEL ENTORNO CONSTRUIDO"}]
[null,null,null,null,{"$f":"TABLAS!$AL$5","v":"ETAPA II: ANÁLISIS Y DIAGNÓSTICO"}]
[null,null,{"$f":"TABLAS!$AL$4","v":""}]
["II.g Estado del parque privado no residencial"]
[]
["Nº de edificios en mal estado, en uso"]
[]
["De los cuales tienen Orden de Ejecución"]
[]
["Nº de edificios ruinosos, en desuso"]
[]
["De los cuales tienen Orden de Ejecución"]
[]
["Nº de solares (suelo con calificación distinta a “residencial”)"]
[]
["Observaciones:"]

{"sheet":"ETAPA II.h","index":6,"n_rows":505,"n_cols":7,"rows_kept":505,"cut":false,"hidden":false,"merged":[[504,2,505,2],[507,2,508,2],[507,6,508,6],[510,2,511,2],[510,6,511,6],[498,2,499,2],[498,6,499,6],[500,2,501,2],[500,6,501,6],[502,2,503,2],[502,6,503,6],[492,2,493,2],[492,6,493,6],[494,2,495,2],[494,6,495,6],[496,2,497,2],[496,6,497,6],[484,2,485,2],[484,6,485,6],[487,2,488,2],[487,6,488,6],[490,0,490,2],[490,4,490,6],[477,2,478,2],[477,6,478,6],[480,2,481,2],[480,6,481,6],[482,2,483,2],[482,6,483,6],[468,2,469,2],[468,3,489,3],[468,6,469,6],[469,0,469,1],[470,2,471,2],[470,6,471,6],[472,2,473,2],[472,6,473,6],[474,2,475,2],[474,6,475,6],[458,2,459,2],[458,6,459,6],[462,0,462,6],[465,0,465,1],[466,0,466,2],[466,4,466,6],[451,2,452,2],[451,6,452,6],[453,2,454,2],[453,6,454,6],[455,2,456,2],[455,6,456,6],[445,2,446,2],[445,6,446,6],[447,2,448,2],[447,6,448,6],[449,2,450,2],[449,6,450,6],[439,0,439,2],[439,4,439,6],[441,2,442,2],[441,6,442,6],[443,2,444,2],[443,6,444,6],[429,2,430,2],[429,6,430,6],[432,2,433,2],[432,6,433,6],[436,2,437,2],[436,6,437,6],[423,2,424,2],[423,6,424,6],[425,2,426,2],[425,6,426,6],[427,2,428,2],[427,6,428,6],[415,0,415,2],[415,4,415,6],[417,2,418,2],[417,3,438,3],[417,6,418,6],[418,0,418,1],[419,2,420,2],[419,6,420,6],[421,2,422,2],[421,6,422,6],[405,2,406,2],[405,6,406,6],[408,2,409,2],[408,6,409,6],[411,0,411,6],[414,0,414,1],[398,2,399,2],[398,6,399,6],[400,2,401,2],[400,6,401,6],[403,2,404,2],[403,6,404,6],[392,2,393,2],[392,6,393,6],[394,2,395,2],[394,6,395,6],[396,2,397,2],[396,6,397,6],[385,2,386,2],[385,6,386,6],[388,0,388,2],[388,4,388,6],[390,2,391,2],[390,6,391,6],[360,0,360,6],[363,0,363,1],[364,0,364,2],[364,4,364,6],[366,2,367,2],[366,3,387,3],[366,6,367,6],[367,0,367,1],[368,2,369,2],[368,6,369,6],[376,2,377,2],[376,6,377,6],[379,2,380,2],[379,6,380,6],[382,2,383,2],[382,6,383,6],[370,2,371,2],[370,6,371,6],[372,2,373,2],[372,6,373,6],[374,2,375,2],[374,6,375,6],[351,2,352,2],[351,6,352,6],[353,2,354,2],[353,6,354,6],[355,2,356,2],[355,6,356,6],[345,2,346,2],[345,6,346,6],[347,2,348,2],[347,6,348,6],[349,2,350,2],[349,6,350,6],[339,2,340,2],[339,6,340,6],[341,2,342,2],[341,6,342,6],[343,2,344,2],[343,6,344,6],[328,2,329,2],[328,6,329,6],[330,2,331,2],[330,6,331,6],[332,6,333,6],[337,0,337,2],[337,4,337,6],[322,2,323,2],[322,6,323,6],[324,2,325,2],[324,6,325,6],[326,2,327,2],[326,6,327,6],[314,2,315,2],[314,3,336,3],[314,6,315,6],[315,0,315,1],[316,2,317,2],[316,6,317,6],[318,2,319,2],[318,6,319,6],[320,2,321,2],[320,6,321,6],[305,2,306,2],[305,6,306,6],[308,0,308,6],[311,0,311,1],[312,0,312,2],[312,4,312,6],[298,2,299,2],[298,6,299,6],[300,2,301,2],[300,6,301,6],[302,2,303,2],[302,6,303,6],[292,2,293,2],[292,6,293,6],[294,2,295,2],[294,6,295,6],[296,2,297,2],[296,6,297,6],[286,2,287,2],[286,6,287,6],[288,2,289,2],[288,6,289,6],[290,2,291,2],[290,6,291,6],[280,2,281,2],[280,6,281,6],[282,2,283,2],[282,6,283,6],[284,0,284,2],[284,4,284,6],[257,0,257,6],[260,0,260,1],[261,0,261,2],[261,4,261,6],[263,2,264,2],[263,3,283,3],[263,6,264,6],[264,0,264,1],[265,2,266,2],[265,6,266,6],[273,2,274,2],[273,6,274,6],[275,2,276,2],[275,6,276,6],[277,2,278,2],[277,6,278,6],[267,2,268,2],[267,6,268,6],[269,2,270,2],[269,6,270,6],[271,2,272,2],[271,6,272,6],[246,2,247,2],[246,6,247,6],[248,2,249,2],[248,6,249,6],[251,2,252,2],[251,6,252,6],[240,2,241,2],[240,6,241,6],[242,2,243,2],[242,6,243,6],[244,2,245,2],[244,6,245,6],[234,0,234,2],[234,4,234,6],[236,2,237,2],[236,6,237,6],[238,2,239,2],[238,6,239,6],[224,2,225,2],[224,6,225,6],[227,2,228,2],[227,6,228,6],[231,2,232,2],[231,6,232,6],[216,6,217,6],[218,2,219,2],[218,6,219,6],[220,2,221,2],[220,6,221,6],[222,2,223,2],[222,6,223,6],[209,0,209,1],[210,0,210,2],[210,4,210,6],[212,2,213,2],[212,3,233,3],[212,6,213,6],[213,0,213,1],[214,2,215,2],[214,6,215,6],[216,2,217,2],[197,2,198,2],[197,6,198,6],[199,6,200,6],[202,2,203,2],[202,6,203,6],[206,0,206,6],[191,2,192,2],[191,6,192,6],[193,2,194,2],[193,6,194,6],[195,2,196,2],[195,6,196,6],[185,2,186,2],[185,6,186,6],[187,2,188,2],[187,6,188,6],[189,2,190,2],[189,6,190,6],[178,2,179,2],[178,6,179,6],[180,2,181,2],[180,6,181,6],[183,0,183,2],[183,4,183,6],[155,0,155,6],[158,0,158,1],[159,0,159,2],[159,4,159,6],[161,2,162,2],[161,3,182,3],[161,6,162,6],[162,0,162,1],[163,2,164,2],[163,6,164,6],[171,2,172,2],[171,6,172,6],[173,2,174,2],[173,6,174,6],[175,2,176,2],[175,6,176,6],[165,2,166,2],[165,6,166,6],[167,2,168,2],[167,6,168,6],[169,2,170,2],[169,6,170,6],[145,2,146,2],[145,6,146,6],[148,2,149,2],[148,6,149,6],[152,2,153,2],[152,6,153,6],[138,2,139,2],[138,6,139,6],[140,2,141,2],[140,6,141,6],[142,2,143,2],[142,6,143,6],[132,0,132,2],[132,4,132,6],[134,2,135,2],[134,6,135,6],[136,2,137,2],[136,6,137,6],[124,2,125,2],[124,6,125,6],[126,2,127,2],[126,6,127,6],[129,2,130,2],[129,6,130,6],[116,2,117,2],[116,6,117,6],[119,2,120,2],[119,6,120,6],[122,2,123,2],[122,6,123,6],[108,0,108,2],[108,4,108,6],[110,2,111,2],[110,3,131,3],[110,6,111,6],[111,0,111,1],[112,2,113,2],[112,6,113,6],[114,2,115,2],[114,6,115,6],[98,2,99,2],[98,6,99,6],[101,2,102,2],[101,6,102,6],[104,0,104,6],[107,0,107,1],[92,2,93,2],[92,6,93,6],[94,2,95,2],[94,6,95,6],[96,2,97,2],[96,6,97,6],[86,2,87,2],[86,6,87,6],[88,2,89,2],[88,6,89,6],[90,2,91,2],[90,6,91,6],[80,0,80,2],[80,4,80,6],[82,2,83,2],[82,6,83,6],[84,2,85,2],[84,6,85,6],[58,2,59,2],[58,3,79,3],[58,6,59,6],[59,0,59,1],[60,2,61,2],[60,6,61,6],[62,2,63,2],[62,6,63,6],[64,2,65,2],[64,6,65,6],[72,2,73,2],[72,6,73,6],[74,2,75,2],[74,6,75,6],[77,2,78,2],[77,6,78,6],[66,2,67,2],[66,6,67,6],[68,2,69,2],[68,6,69,6],[70,2,71,2],[70,6,71,6],[48,2,49,2],[48,6,49,6],[52,0,52,6],[55,0,55,1],[56,0,56,2],[56,4,56,6],[41,2,42,2],[41,6,42,6],[43,2,44,2],[43,6,44,6],[45,2,46,2],[45,6,46,6],[35,2,36,2],[35,6,36,6],[37,2,38,2],[37,6,38,6],[39,2,40,2],[39,6,40,6],[29,0,29,2],[29,4,29,6],[31,2,32,2],[31,6,32,6],[33,2,34,2],[33,6,34,6],[0,0,0,6],[5,0,5,1],[6,0,6,2],[6,4,6,6],[8,2,9,2],[8,3,28,3],[8,6,9,6],[10,2,11,2],[10,6,11,6],[12,2,13,2],[20,2,21,2],[20,6,21,6],[22,2,23,2],[22,6,23,6],[25,2,26,2],[25,6,26,6],[12,6,13,6],[14,2,15,2],[14,6,15,6],[16,2,17,2],[16,6,17,6],[18,2,19,2],[18,6,19,6]]}
[{"$f":"TABLAS!$AL$2","v":"BASES PARA LA ELABORACIÓN DE UNA ESTRATEGIA DE REHABILITACIÓN DEL ENTORNO CONSTRUIDO"}]
[null,null,null,null,null,null,"ETAPA II: ANÁLISIS Y DIAGNÓSTICO"]
[null,null,null,null,null,null,{"$f":"TABLAS!$AL$4","v":""}]
["II.h   Análisis DAFO"]
[]
[{"$f":"IF((COUNTA(A9:A27,E9:E27,A32:A50,E32:E50)>0),\"þ\",\"\")","v":""},null,"EJE 1. TERRITORIO, PAISAJE Y BIODIVERSIDAD"]
["DEBILIDADES",null,null,null,"AMENAZAS"]
[]
[null,null,"D.01 Orografía y estructura morfológica compleja. Elementos físicos (cauces fluviales, infraestructuras u otros) que condicionan la conectividad o el desarrollo.",null,null,null,"A.01 Planificación territorial escasa o deficiente, lo que en algunas ocasiones dificulta la visión estratégica de un desarrollo urbano supramunicipal."]
[]
[null,null,"D.02 Desarrollo territorial disperso de escasa densidad asociado generalmente a problemas de movilidad y de prestación de servicios urbanos.",null,null,null,"A.02 Desarrollo territorial más enfocado a la expansión que a la regeneración urbana, en ocasiones, con un crecimiento planificado sobredimensionado."]
[]
[null,null,"D.03 Deterioro ambiental de determinados entornos que pueden acarrear una pérdida de la biodiversidad y/o un deterioro del paisaje y de la calidad de vida urbana.",null,null,null,"A.03 Zonas en declive o estancamiento demográfico, en un fenómeno de alcance territorial de pérdida de población y hogares, y una elevada tasa de envejecimiento."]
[]
[null,null,"D.04 Falta de conexión entre el entorno urbano y el rural, que puede implicar un fenómeno de congestión de las áreas urbanas y/o despoblación y abandono rural.",null,null,null,"A.04 Déficit de medidas de protección y conservación del patrimonio natural, cultural y paisajístico, para hacer frente a su degradación y combatir el vandalismo."]
[]
[null,null,"D.05 Antagonismo entre la perspectiva de la planificación urbana y la rural;\nla urbana tiene como eje el desarrollo, la rural proteger y conservar.",null,null,null,"A.05 Falta de flexibilidad en los instrumentos de planificación, para adoptar medidas como la creación de corredores ecológicos y combatir la pérdida de la biodiversidad."]
[]
[null,null,"D.06 Ausencia de medidas explícitas para compensar a los pequeños municipios ante el crecimiento de los municipios más grandes.",null,null,null,"A.06 Turismo insostenible, gran consumidor de recursos."]
[]
[null,null,"D.07 Necesidad de abordar el fenómeno de la despoblación desde el estu- dio del territorio y los instrumentos de planificación de nivel supralocal o comarcal.",null,null,null,"A.07 Planificación rural demasiado bucólica, basada en la protección del medio rural, que no contempla otros activos."]
[]
[null,null,"D.08 Modelos de planificación rígidos, que demandan escalas distintas y objetivos diferentes para los nuevos problemas."]
[]
[]
[]
[]
[null,null," "]
[]
["FORTALEZAS",null,null,null,"OPORTUNIDADES"]
[]
[null,null,"F.01 Experiencia en iniciativas de desarrollo sostenible y utilización de Instrumentos de planificación (planes urbanísticos, territoriales, de sostenibilidad, de movilidad urbana sostenible, de calidad del aire, etc.).",null,null,null,"O.01 Conexión de la ciudad con el entorno rural mejorando la calidad ambiental de la ciudad, a través de la recuperación de espacios degradados y su conversión en zonas verdes en conexión con los activos naturales del municipio."]
[]
[null,null,"F.02  Riqueza del patrimonio natural y medioambiental, cuyo uso y gestión es clave en la generación de procesos sostenibles.",null,null,null,"O.02 Patrimonio natural infrautilizado, que puede constituir la base sobre la que desarrollar actuaciones y estrategias de desarrollo urbano sostenible."]
[]
[null,null,"F.03 Riqueza agrícola, ganadera y forestal del entorno, que contribuye al desarrollo económico de la ciudad y ofrece un elemento de vinculación entre lo urbano y lo rural.",null,null,null,"O.03 Atractivo de alcance territorial de los bienes culturales, como elementos clave en el desarrollo urbano y de competitividad de las ciudades."]
[]
[null,null,"F.04 Creciente interés y valoración social y del sector empresarial, del patrimonio natural y paisajístico, favorable a un desarrollo más sostenible.",null,null,null,"O.04 Presencia de grandes infraestructuras e instalaciones, que pueden aportar ventajas competitivas, como la proximidad a aeropuertos, puertos comerciales o complejos industriales."]
[]
[null,null,"F.05 Ciudades bien comunicadas, lo que favorece el desarrollo de áreas dinámicas de actividad y la calidad de vida de los ciudadanos.",null,null,null,"O.05 Amplia red de caminos naturales y rurales, como potencial de mejora del entorno rural y del medio ambiente, y su vinculación con el medio urbano."]
[]
[null,null,"F.06 Riqueza del paisaje y de la biodiversidad con una gran capacidad de servir de base para la mejora de la calidad de vida urbana.",null,null,null,"O.06 Patrimonio natural y paisajístico infrautilizado, con gran potencial para desarrollar actuaciones de dotación de servicios e infraestructuras."]
[]
[null,null,"F.07 Consideración del sector primario como un posible activo económico.",null,null,null,"O.07 Medio natural, paisaje y patrimonio como base para un turismo sostenible respetuoso con el medio ambiente, no consumidor de recursos."]
[]
[null,null,null,null,null,null,"O.08 Existencia de un Plan nacional contra la despoblación: documento elaborado por la Comisión de Despoblación de la FEMP"]
[]
[]
[]
[]
[]
[]
[{"$f":"TABLAS!$AL$2","v":"BASES PARA LA ELABORACIÓN DE UNA ESTRATEGIA DE REHABILITACIÓN DEL ENTORNO CONSTRUIDO"}]
[null,null,null,null,null,null,{"$f":"IF($G$2=\"\",\"\",$G$2)","v":"ETAPA II: ANÁLISIS Y DIAGNÓSTICO"}]
[null,null,null,null,null,null,{"$f":"TABLAS!$AL$4","v":""}]
[{"$f":"IF((COUNTA(A59:A77,E59:E77,A83:A101,E83:E101)>0),\"þ\",\"\")","v":""},null,"EJE 2. MODELO DE CIUDAD"]
["DEBILIDADES",null,null,null,"AMENAZAS"]
[]
[null,null,"D.01 Déficit o inadecuación del espacio público, zonas verdes y espacios libres, con los consiguientes efectos negativos sobre la salud y la calidad de vida.",null,null,null,"A.01 Centro urbano degradado y/o en proceso de abandono, como consecuencia de unas dinámicas supramunicipales de desplazamiento de los hogares a zonas periurbanas."]
[]
[null,null,"D.02 Déficit de infraestructuras y servicios urbanos, por inexistencia de ellos o por su falta de adecuación a las nuevas realidades y demandas de la población.",null,null,null,"A.02 Déficit de infraestructuras y servicios urbanos. Puede tratarse de la inexistencia de ellos o de la adaptación a las nuevas realidades y demandas de la población."]
[]
[null,null,"D.03 Problemas de accesibilidad y barreras arquitectónicas, especialmente, en los espacios públicos urbanizados.",null,null,null,"A.03 Fuerte estacionalidad turística que puede producir un desajuste en el uso del espacio público y las dotaciones de servicios e infraestructuras urbanas."]
[]
[null,null,"D.04 Centro urbano degradado y/o en proceso de abandono, con frecuencia, derivados de un desplazamiento de los hogares jóvenes a barrios periféricos de la ciudad.",null,null,null,"A.04 Disminución del tamaño medio del hogar, un fenómeno demográfico global que tiene importantes implicaciones en el modelo de ciudad y la adecuación del parque de vivienda."]
[]
[null,null,"D.05 Parque edificatorio deficiente. Elevada tasa de edificios de viviendas y destinados a otros usos ineficientes energéticamente y con problemas de accesibilidad.",null,null,null,"A.05 Falta de flexibilidad en los instrumentos de planificación, para adoptar medidas como la creación de corredores ecológicos y combatir la pérdida de la biodiversidad."]
[]
[null,null,"D.06 Contaminación acústica y lumínica en determinadas zonas, con los problemas que ello implica en el medio ambiente, la calidad de vida y la salud.",null,null,null,"A.06 Prioridad de la inversión privada en los centros urbanos frente a la pública, lo que puede dar lugar a procesos de gentrificación."]
[]
[null,null,"D.07 Contaminación de determinados ámbitos de suelo. Determinados espacios urbanos que presentan elevados índices de contaminación, sobre los que es preciso actuar."]
[]
[null,null,"D.08 Complejidad de ordenación y configuración por el trazado histórico en los barrios."]
[]
[null,null,"D.09 Modelo de desarrollo urbano de las últimas décadas sectorial y monofuncional, con los consiguientes problemas de movilidad, proximidad, gasto energético y sostenibilidad."]
[]
[]
[]
[]
[]
["FORTALEZAS",null,null,null,"OPORTUNIDADES"]
[]
[null,null,"F.01 Riqueza del patrimonio urbano y arquitectónico con un alto valor histórico, artístico y cultural, que constituyen activos de gran potencialidad y seña de identidad local.",null,null,null,"O.01 Programas de ayudas y fondos autonómicos, nacionales y europeos para promover un desarrollo urbano equilibrado, sostenible e integrado."]
[]
[null,null,"F.02 Ciudad compacta, especialmente, en los centros urbanos, con una trama urbana que facilita el encuentro ciudadano, la movilidad sostenible y la actividad.",null,null,null,"O.02 Políticas autonómicas y nacionales en relación a la rehabilitación, regeneración y renovación urbana que fomentan un modelo de ciudad más sostenible."]
[]
[null,null,"F.03 Ciudades bien comunicadas, que permiten el desarrollo de importantes enclaves de actividad logística para el desarrollo económico y de determinadas industrias.",null,null,null,"O.03 Integración de las zonas turísticas y costeras con las infraestructuras de comunicación de las ciudades."]
[]
[null,null,"F.04 Multiculturalidad y diversidad de los barrios, como un factor enriquecedor que puede servir de base para constituir una comunidad urbana integrada.",null,null,null,"O.04 Potencialidad de las grandes ciudades como punto de atracción para ciudades cercanas (red policéntrica)."]
[]
[null,null,"F.05 Notable avance en la mejora del espacio público, principalmente en relación con la accesibilidad, la movilidad sostenible y la peatonalización.",null,null,null,"O.05 Conexión de la ciudad con el entorno rural mejorando el equilibrio entre el área urbana y rural para evitar la cogestión en las ciudades y la despoblación de las zonas rurales."]
[]
[null,null,"F.06 Revisión de los instrumentos de ordenación urbanística para un desarrollo más sostenible y equilibrado, en ocasiones, desclasificando suelo innecesario.",null,null,null,"O.06 Programas y fuentes de financiación para la conservación del patrimonio arquitectónico."]
[]
[null,null,"F.07 Aceptación generalizada de la importancia de la participación de sociedad civil, administraciones y sector privado en la producción de ciudad sostenible.",null,null,null,"O.07 Difusión y potenciación de la cultura, deporte, gastronomía, patrimonio, fiestas tradicionales de los pueblos y ciudades de España."]
[]
[null,null,"F.08 Conciencia social sobre la necesidad de pensar en un modelo de ciudad más sostenible.",null,null,null,"O.08 Nuevos usos vinculados al turismo que favorezcan la conservación del patrimonio arquitectónico, dada la relevancia turística de numerosas ciudades españolas."]
[]
[null,null,null,null,null,null,"O.09 Metodología de Diagnóstico y Plan de Acción del Destino Turístico Inteligente al servicio de una ciudad más sostenible."]
[]
[]
[]
[]
[]
[{"$f":"TABLAS!$AL$2","v":"BASES PARA LA ELABORACIÓN DE UNA ESTRATEGIA DE REHABILITACIÓN DEL ENTORNO CONSTRUIDO"}]
[null,null,null,null,null,null,{"$f":"IF($G$2=\"\",\"\",$G$2)","v":"ETAPA II: ANÁLISIS Y DIAGNÓSTICO"}]
[null,null,null,null,null,null,{"$f":"TABLAS!$AL$4","v":""}]
[{"$f":"IF((COUNTA(A111:A129,E111:E129,A135:A152,E135:E152)>0),\"þ\",\"\")","v":""},null,"EJE 3. CAMBIO CLIMÁTICO Y RESILIENCIA"]
["DEBILIDADES",null,null,null,"AMENAZAS"]
[]
[null,null,"D.01 Alto consumo energético fósil, principalmente en edificios y en transporte, lo que tiene importantes repercusiones en el medio ambiente y la calidad de vida.",null,null,null,"A.01 Contaminación atmosférica/medioambiental. Elevados niveles de emisión de gases de efecto invernadero y de contaminación de alcance territorial."]
[]
[null,null,"D.02 Contaminación derivada de la industria y la actividad. Con frecuencia, la actividad económica y determinadas industrias producen agentes contaminantes.",null,null,null,"A.02 Riesgos naturales y efectos del cambio climático. Exposición a los riesgos naturales y problemas vinculados al cambio climático, como inundaciones, olas de calor o sequías."]
[]
[null,null,"D.03 Urbanismo poco resiliente al cambio climático.",null,null,null,"A.03 Problemas de salud y calidad de vida vinculados a los efectos del cambio climático o la contaminación atmosférica y de los riesgos y efectos de la actividad industrial."]
[]
[null,null,"D.04 Estudios y medidas de adaptación al cambio climático insuficientes."]
[]
[]
[]
[]
[]
[]
[]
[]
[]
[]
[]
[]
[]
[]
[]
["FORTALEZAS",null,null,null,"OPORTUNIDADES"]
[]
[null,null,"F.01 Políticas públicas en materia de mitigación del Cambio Climático y de fomento de energías sostenibles.",null,null,null,"O.01 Políticas nacionales y europeas relacionadas con la adaptación-mitigación al cambio climático; traslación a la realidad local."]
[]
[null,null,"F.02 Condiciones climáticas que favorecen la calidad de vida de los ciudadanos y reducen el consumo energético.",null,null,null,"O.02 Conexión de la ciudad con el entorno rural mejorando la calidad ambiental de la ciudad, a través de la recuperación de espacios degradados y su conversión en zonas verdes en conexión con los activos naturales del municipio."]
[]
[null,null,"F.03 Medidas para el control del ruido y emisiones contaminantes, a través de una evaluación de la situación que permite adoptar las medidas correctoras pertinentes.",null,null,null,"O.03 Redes de ciudades, programas de adhesión a pactos o estrategias para la mejora de eficiencia energética, energías renovables y contra el cambio climático."]
[]
[null,null,"F.04 Potencial en economía baja en carbono, energías limpias y lucha contra el cambio climático de determinadas iniciativas ambientales ciudadanas.",null,null,null,"O.04 Incremento de la sensibilización ciudadana en materia medioambiental y ante el reto del cambio climático y sus efectos en los entornos urbanos."]
[]
[null,null,"F.05 Implantación de medidas para la lucha contra incendios forestales o inundaciones, como planes de gestión y mejora forestal o agencias para el estudio de inundaciones."]
[]
[]
[]
[]
[]
[]
[]
[]
[]
[]
[]
[]
[{"$f":"TABLAS!$AL$2","v":"BASES PARA LA ELABORACIÓN DE UNA ESTRATEGIA DE REHABILITACIÓN DEL ENTORNO CONSTRUIDO"}]
[null,null,null,null,null,null,{"$f":"IF($G$2=\"\",\"\",$G$2)","v":"ETAPA II: ANÁLISIS Y DIAGNÓSTICO"}]
[null,null,null,null,null,null,{"$f":"TABLAS!$AL$4","v":""}]
[{"$f":"IF((COUNTA(A162:A180,E162:E180,A186:A204,E186:E204)>0),\"þ\",\"\")","v":""},null,"EJE 4. GESTIÓN SOSTENIBLE DE LOS RECURSOS Y ECONOMÍA CIRCULAR"]
["DEBILIDADES",null,null,null,"AMENAZAS"]
[]
[null,null,"D.01 Infraestructuras locales poco eficientes, sobre las que es necesario acometer actuaciones para mejorar su eficiencia energética e incorporar las energías renovables.",null,null,null,"A.01 Alta dependencia energética exterior en un contexto de escasa producción de energías renovables en el ámbito municipal y bajo nivel de autosuficiencia."]
[]
[null,null,"D.02 Inadecuado sistema de gestión de residuos, con difícil acceso al casco o con instalaciones deficientes u obsoletas en el contexto del reciclaje y la economía circular.",null,null,null,"A.02 Aumento de la presión sobre la salud humana, el medioambiente y sobre los recursos naturales o un déficit ecológico por una excesiva generación de residuos y un elevado consumo de recursos."]
[]
[null,null,"D.03 Deficiente gestión e infraestructuras hídricas. Problemas vinculados una inadecuada gestión de las redes de abastecimiento de agua o recursos hídricos.",null,null,null,"A.03 Elevada presión turística que en ocasiones genera un gran impacto sobre determinadas zonas, especialmente en el caso del litoral u otros entornos sensibles ambientalmente."]
[]
[null,null,"D.04 Actividades productivas de baja eficiencia energética, con un elevado consumo de energía final.",null,null,null,"A.04 Efectos de explotaciones agrícolas intensivas en determinados entornos en los que existe un elevado desarrollo de esta actividad."]
[]
[null,null,"D.05 Sistemas de depuración de aguas residuales de alto coste de explotación.",null,null,null,"A.05 Problemas de gestión hídrica de alcance supramunicipal o regional que pueden afectar a los entornos urbanos."]
[]
[null,null,"D.06 Escasa cultura pública y privada sobre el uso compartido de bienes o la adquisición de bienes reutilizados, reciclados o re-fabricados.",null,null,null,"A.06 Aspectos de la normativa supramunicipal que implican determinadas barreras para el desarrollo e implantación de las energías renovables."]
[]
[null,null,"D.07 Metabolismo urbano: escaso desarrollo de planteamientos holísticos.",null,null,null,"A.07 Escasez de materias primas esenciales y aumento de los precios para el desarrollo de la economía global y local."]
[]
[null,null,null,null,null,null,"A.08 Aumento de población en situación de “pobreza energética”."]
[]
[]
[]
[]
[]
[]
[]
["FORTALEZAS",null,null,null,"OPORTUNIDADES"]
[]
[null,null,"F.01 Riqueza del patrimonio natural y medioambiental, cuyo uso y gestión es clave en la generación de procesos sostenibles.",null,null,null,"O.01 Políticas nacionales y europeas relacionadas con la promoción de las energías renovables y la eficiencia energética."]
[]
[null,null,"F.02 Políticas municipales en materia de eficiencia energética, como la mejora del alumbrado público o la incorporación de energías renovables en edificios e instalaciones municipales.",null,null,null,"O.02 Patrimonio natural infrautilizado, que puede constituir la base sobre la que desarrollar actuaciones y estrategias de desarrollo urbano sostenible."]
[]
[null,null,"F.03 Buena calidad del agua y/o del aire, en términos generales, con efectos positivos sobre la salud humana.",null,null,null,"O.03 El desarrollo de la actividad de gestión de residuos como ámbito clave en la mejora y conservación del medio ambiente y la generación de empleo en las ciudades."]
[]
[null,null,"F.04 Medidas para el control del ruido y emisiones contaminantes, a través de una evaluación de la situación que permite adoptar las medidas correctoras pertinentes.",null,null,null,"O.04 Redes de ciudades, programas de adhesión a pactos o estrategias para la mejora de eficiencia energética, energías renovables y contra el cambio climático."]
[]
[null,null,"F.05 Implantación de medidas para la lucha contra incendios forestales o inundaciones, como planes de gestión y mejora forestal o agencias para el estudio de inundaciones.",null,null,null,"O.05 Desarrollo tecnológico vinculado a la generación energética a través de fuentes renovables en los entornos urbanos, al ahorro y eficiencia en el alumbrado público…"]
[]
[null,null,"F.06 Capacidad técnica y tecnológica para la implantación de energías renovables.",null,null,null,"O.06 Elevado potencial de desarrollo de energías renovables, especialmente la fotovoltaica."]
[]
[null,null,null,null,null,null,"O.07 Necesidad de materia orgánica para mantener la capacidad productiva del suelo y la superficie verde de las ciudades."]
[]
[null,null,null,null,null,null,"O.08 Apuesta por un crecimiento sostenible bajo los principios de la economía circular, aprovechando el crecimiento económico."]
[]
[]
[]
[]
[]
[]
[{"$f":"TABLAS!$AL$2","v":"BASES PARA LA ELABORACIÓN DE UNA ESTRATEGIA DE REHABILITACIÓN DEL ENTORNO CONSTRUIDO"}]
[null,null,null,null,null,null,{"$f":"IF($G$2=\"\",\"\",$G$2)","v":"ETAPA II: ANÁLISIS Y DIAGNÓSTICO"}]
[null,null,null,null,null,null,{"$f":"TABLAS!$AL$4","v":""}]
[{"$f":"IF((COUNTA(A213:A231,E213:E231,A237:A255,E237:E255)>0),\"þ\",\"\")","v":""},null,"EJE 5. MOVILIDAD Y TRANSPORTE"]
["DEBILIDADES",null,null,null,"AMENAZAS"]
[]
[null,null,"D.01 Patrones de movilidad poco sostenible, con un predominio del desplazamiento en vehículo privado, frente a la movilidad peatonal o ciclista.",null,null,null,"A.01 Efectos de movilidad vinculados a un desarrollo territorial disperso de escasa densidad, por nuevas expansiones urbanas o urbanizaciones aisladas."]
[]
[null,null,"D.02 Problemas de tráfico y movilidad, de circulación y congestión en las ciudades y áreas urbanas debido al tráfico diario de los desplazamientos casa- trabajo.",null,null,null,"A.02 Problemas de tráfico y movilidad, de circulación y congestión en los accesos a las ciudades y áreas urbanas por desplazamientos vinculados al turismo y al ocio."]
[]
[null,null,"D.03 Déficit de transporte público, carencia y deficiencias en determinadas zonas y falta de intercambiadores o infraestructuras que faciliten la intermodalidad.",null,null,null,"A.03 Mejora de la red de carreteras en el ámbito territorial que puede incentivar el uso del vehículo privado en detrimento del trasporte público."]
[]
[null,null,"D.04 Déficit de aparcamientos disuasorios en el acceso a las grandes ciudades.",null,null,null,"A.04 Incremento de los niveles de contaminación atmosférica como efecto del uso del vehículo privado en el entorno urbano y espacios periurbanos."]
[]
[null,null,"D.05 Déficit de infraestructuras de movilidad sostenible, de red de carril bici o de infraestructuras para el despliegue de la movilidad alternativa.",null,null,null,"A.05 Problemas de movilidad consecuencia de altos flujos de movimiento en determinadas zonas y periodos que pueden verse afectados por el incremento de afluencia del turismo."]
[]
[null,null,"D.06 Ausencia de una estrategia de movilidad integrada y ligada a la accesibilidad y a planes de movilidad urbana sostenible, consistentes con cada realidad urbana."]
[]
[null,null,"D.07 Los procesos de dispersión demográfica y actividades en las áreas metropolitanas están creando problemas de conectividad y disfuncionalidad en el uso de las redes de transporte."]
[]
[]
[]
[]
[]
[]
[]
[]
[]
["FORTALEZAS",null,null,null,"OPORTUNIDADES"]
[]
[null,null,"F.01 Iniciativas municipales y trabajos desarrollados para la elaboración y aprobación de Planes de Movilidad Urbana Sostenible (PMUS).",null,null,null,"O.01 Programas y fondos autonómicos, nacionales y europeos, que facilitan y promueven las infraestructuras de movilidad urbana sostenible."]
[]
[null,null,"F.02 Proyectos e iniciativas municipales para el fomento del transporte público sostenible y no contaminante.",null,null,null,"O.02 Presencia de grandes infraestructuras de transporte, que mejoran la accesibilidad territorial y la movilidad como aeropuertos o puertos comerciales."]
[]
[null,null,"F.03 Ciudades bien comunicadas, con carácter general, dotadas de una buena red de infraestructuras de comunicación, mejorada en los últimos años.",null,null,null,"O.03 Potencialidad de las redes policéntricas de ciudades como soporte para plantear una estrategia territorial de movilidad sostenible."]
[]
[null,null,"F.04 Modelo de ciudad compacta, especialmente en los centros urbanos, lo que facilita la proximidad y la movilidad sostenible.",null,null,null,"O.04 Planes supramunicipales de transporte sostenible, que mejoren la conexión interurbana con transporte público sostenible y con medios de transporte blando."]
[]
[null,null,"F.05 Condiciones favorables de clima y topografía para el impulso de los medios de transporte blandos: peatonal y bicicleta.",null,null,null,"O.05 Introducción de las TIC en la en la gestión de los servicios urbanos de transporte, como elemento clave de mejora de su calidad y sostenibilidad."]
[]
[null,null,"F.06 Numerosas actuaciones relacionadas con la movilidad sostenible: principalmente peatonalización y carriles bici.",null,null,null,"O.06 Posibilidad de creación de aparcamientos disuasorios."]
[]
[null,null,null,null,null,null,"O.07 Concienciar y educar a la sociedad sobre la movilidad y el transporte sostenibles."]
[]
[]
[]
[]
[]
[]
[]
[]
[{"$f":"TABLAS!$AL$2","v":"BASES PARA LA ELABORACIÓN DE UNA ESTRATEGIA DE REHABILITACIÓN DEL ENTORNO CONSTRUIDO"}]
[null,null,null,null,null,null,{"$f":"IF($G$2=\"\",\"\",$G$2)","v":"ETAPA II: ANÁLISIS Y DIAGNÓSTICO"}]
[null,null,null,null,null,null,{"$f":"TABLAS!$AL$4","v":""}]
[{"$f":"IF((COUNTA(A264:A282,E264:E282,A287:A305,E287:E305)>0),\"þ\",\"\")","v":""},null,"EJE 6. COHESIÓN SOCIAL E IGUALDAD DE OPORTUNIDADES"]
["DEBILIDADES",null,null,null,"AMENAZAS"]
[]
[null,null,"D.01 Elevada tasa de envejecimiento, como consecuencia de la caída de la natalidad, de la emigración de la población joven, o la inmigración de personas extranjeras de avanzada edad.",null,null,null,"A.01 Desigualdad económica y social del entorno y elevada pobreza relativa, en el marco de unas dinámicas territoriales que afectan a la ciudad en su conjunto."]
[]
[null,null,"D.02 Elevada tasa de desempleo, asociado al aumento de la población en riesgo de exclusión social y al incremento del número de demandantes de servicios sociales.",null,null,null,"A.02 Prestaciones sociales insuficientes o no adaptadas a las nuevas realidades y demandas de la población, especialmente para los colectivos más desfavorecidos."]
[]
[null,null,"D.03 Barrios sumidos en procesos de degradación y/o abandono, lo que agrava los problemas sociales de sus residentes.",null,null,null,"A.03 Aumento del peso de la denominada cuarta edad, que conllevará un aumento significativo de las demandas sociales en un contexto de importante brecha digital."]
[]
[null,null,"D.04 Concentración de la vulnerabilidad urbana y exclusión social en determinados entornos, caracterizados por un mayor porcentaje de pobreza urbana y de desempleo.",null,null,null,"A.04 Desigualdad y brecha de género, fenómenos que afectan de forma más intensa a determinados colectivos o acentúan las diferencias entre hombres y mujeres."]
[]
[null,null,"D.05 Consecuencias sociales del deterioro del medio ambiente urbano en algunas zonas, que conducen a una pérdida de la calidad de vida y de las oportunidades de sus habitantes.",null,null,null,"A.05 Fuerte estacionalidad turística en determinadas zonas, con serias implicaciones en la prestación de servicios o en el mercado de trabajo local."]
[]
[null,null,"D.06 Ámbitos de infravivienda o asentamientos irregulares, en algunos barrios en los que se identifican problemas de chabolismo o conjuntos de infraviviendas.",null,null,null,"A.06 Brecha entre la formación de la población y los perfiles demandados en el mercado de trabajo, que requiere de actuaciones en materia de educación y formación."]
[]
[null,null,"D.07 Problemas de absentismo y abandono escolar en determinados barrios, que producen un deterioro de las oportunidades socio laborales de sus habitantes.",null,null,null,"A.07 Efectos de determinadas explotaciones agrícolas intensivas en el perfil socioeconómico de la población, con importante presencia de extranjeros o minorías étnicas."]
[]
[null,null,"D.08 Bajo nivel educativo y formativo de la población, en ocasiones, como consecuencia de una actividad económica muy especializada en el sector primario o industrial.",null,null,null,"A.08 Envejecimiento y degradación de barrios construidos en los años 1950-1980, tanto desde el punto de vista demográfico y social, como físico (construcciones e infraestructuras)."]
[]
[]
[]
[]
[]
[]
["FORTALEZAS",null,null,null,"OPORTUNIDADES"]
[]
[null,null,"F.01 Existencia de iniciativas locales, Planes para fomentar la cooperación, mejorar la convivencia, la cohesión social, evitar el absentismo escolar y favorecer la inclusión socio laboral.",null,null,null,"O.01 Desarrollo de programas en el ámbito social, con financiación europea, como oportunidad para mejorar las condiciones socioeconómicas de la población urbana."]
[]
[null,null,"F.02 Experiencia en programas de inclusión social con financiación europea, de acuerdo con la programación de los distintos periodos de fondos de la UE.",null,null,null,"O.02 Iniciativas y programas orientados a atraer población joven, tanto residente como flotante, en materia de vivienda, equipamientos y servicios adaptados."]
[]
[null,null,"F.03 Modelo de ciudad compacta, trama urbana que facilita la convivencia y la solidaridad vecinal, así como el desarrollo y viabilidad de los servicios locales.",null,null,null,"O.03 Uso de las TIC para la mejora de la gobernanza y la participación ciudadana, para mejorar el sentimiento de pertenencia, el compromiso y la cooperación ciudadana."]
[]
[null,null,"F.04 Buen nivel de convivencia y seguridad ciudadana, que caracteriza, en general a las ciudades españolas, dos aspectos que se encuentran estrechamente vinculados.",null,null,null,"O.04 Barrios con fuerte identidad urbana y arraigo social, como factor de atracción para mantener o recuperar población, que atienda a las tradiciones y cultura local."]
[]
[null,null,"F.05 Red de servicios de alta calidad y prestaciones, con las que cuenta la mayor parte de las ciudades en materia de educación, sanitarios, deportivos o para personas mayores.",null,null,null,"O.05 Multiculturalidad y diversidad de los barrios como un factor enriquecedor, que permite el desarrollo de iniciativas vinculadas al respeto y la integración social."]
[]
[null,null,"F.06 Población activa altamente cualificada, con la que cuenta con frecuencia las grandes ciudades, y constituye una base para el desarrollo económico y factor de competitividad.",null,null,null,"O.06 Iniciativas orientadas a fomentar el uso de las TIC para el desarrollo de acciones en materia de administración electrónica y prestación de servicios."]
[]
[null,null,"F.07 Existencia de programas específicos para la atracción de jóvenes y su permanencia en la ciudad, desarrollados en ocasiones a nivel local.",null,null,null,"O.07 Situación estratégica de centro de referencia social y asistencial para las localidades cercanas, que genera un incremento de la actividad urbana."]
[]
[null,null,"F.08 Importante tejido asociacional, con una ciudadanía comprometida con el desarrollo social y económico y la presencia de un gran número de asociaciones.",null,null,null,"O.08 Existencia de espacios públicos y solares vacíos que pueden ser utilizados para actividades vinculadas con el desarrollo social y económico del barrio."]
[]
[null,null,null,null,null,null,"O.09 Desarrollo turístico de zonas despobladas para apoyar la fijación de población al territorio y su dinamización económica."]
[]
[]
[]
[]
[]
[{"$f":"TABLAS!$AL$2","v":"BASES PARA LA ELABORACIÓN DE UNA ESTRATEGIA DE REHABILITACIÓN DEL ENTORNO CONSTRUIDO"}]
[null,null,null,null,null,null,{"$f":"IF($G$2=\"\",\"\",$G$2)","v":"ETAPA II: ANÁLISIS Y DIAGNÓSTICO"}]
[null,null,null,null,null,null,{"$f":"TABLAS!$AL$4","v":""}]
[{"$f":"IF((COUNTA(A315:A335,E315:E335,A340:A358,E340:E358)>0),\"þ\",\"\")","v":""},null,"EJE 7. ECONOMÍA URBANA"]
["DEBILIDADES",null,null,null,"AMENAZAS"]
[]
[null,null,"D.01 Incapacidad de la ciudad para atraer y retener talento, motivada por la falta de tejido empresarial y la brecha entre formación y mercado de trabajo.",null,null,null,"A.01 Elevada tasa de desempleo, ámbito territorial caracterizado por un mayor impacto de la crisis económica, en términos de empleo y actividad."]
[]
[null,null,"D.02 Efectos de una actividad económica muy especializada en un único sector de actividad, como, por ejemplo, la construcción e industrias asociadas o el turismo y los servicios.",null,null,null,"A.02 Sectores productivos predominantes, más afectados por la crisis económica, por tener una importante especialización en sectores como la construcción."]
[]
[null,null,"D.03 Escasa innovación y valor añadido en la economía local, con una escasa presencia de empresas y trabajadores en ámbitos de actividad densos en conocimiento.",null,null,null,"A.03 Dinámicas territoriales de abandono de determinados entornos, como consecuencia de una elevada tasa de desempleo, especialmente en la población joven."]
[]
[null,null,"D.04 Falta de recursos públicos y privados para el desarrollo de actuaciones de impulso y fomento de la actividad económica local y de programas de ayudas y estímulos.",null,null,null,"A.04 Tendencia al decrecimiento económico y poblacional motivado por el impulso o la mayor actividad y atractivo de un área urbana o metropolitana próxima."]
[]
[null,null,"D.05 Alto nivel de desempleo y empleo precarizado en algunas ciudades, con elevada tasa de paro de larga duración, inestabilidad laboral o reducidos niveles retributivos.",null,null,null,"A.05 Destrucción del tejido empresarial local, ante la proximidad de grandes centros comerciales, con especial impacto en pequeñas y medianas empresas."]
[]
[null,null,"D.06 Falta de vocación empresarial entre los jóvenes y de la población de la ciudad, en un contexto de insuficientes oportunidades y medios para el emprendimiento.",null,null,null,"A.06 Obsolescencia o abandono de grandes áreas industriales, debido a factores como la pérdida de competitividad, procesos de reconversión u otras circunstancias."]
[]
[null,null,"D.07 Insuficiente oferta u oportunidades de primer empleo para jóvenes en el área urbana, con escasas alternativas de formación para el empleo en el tejido empresarial.",null,null,null,"A.07 Insuficiencia de medidas de apoyo al emprendimiento y a la implantación empresarial, a través de estímulos como las ayudas económicas o ventajas en la financiación."]
[]
[null,null,"D.08 Escasa inversión privada productiva, en un contexto de prevalencia de la actividad del sector público y un débil tejido empresarial privado.",null,null,null,"A.08 Vulnerabilidad del sector agrícola del entorno, por estar en situación de declive o pendiente de procesos estratégicos de reposicionamiento en el mercado."]
[]
[null,null,null,null,null,null,"A.09 Pérdida de poder adquisitivo de la población, como consecuencia de pérdida de empleo o la precariedad laboral.\n"]
[]
[null,null,null,null,null,null,"A.10 Escasa cultura exportadora, en un contexto de globalización y de in- suficiente coordinación entre el sector público y el tejido empresarial."]
[]
[]
[]
[]
["FORTALEZAS",null,null,null,"OPORTUNIDADES"]
[]
[null,null,"F.01 Activos culturales, patrimoniales y paisajísticos, como elementos clave para fomentar y/o enriquecer la actividad turística, la economía y el empleo.",null,null,null,"O.01 Inversiones públicas y privadas y programas financiados por los fondos europeos orientados a generar actividad económica innovadora y emprendedora."]
[]
[null,null,"F.02 Gran capacidad económica y de creación de empleo en los servicios, turismo e industria, sectores de gran presencia en las grandes ciudades.",null,null,null,"O.02 Políticas autonómicas y nacionales en relación a la rehabilitación, regeneración y renovación urbana como motor de empleo, y reactivador de la construcción."]
[]
[null,null,"F.03 Programas locales de empleo y de fomento de actividades económicas, orientados a determinados colectivos (p.e. Municipios por la Economía del Bien Común).",null,null,null,"O.03 Potencialidad de las redes policéntricas de ciudades como punto de atracción para fomentar y/o implantar actividades económicas."]
[]
[null,null,"F.04 Existencia de una amplia oferta hotelera y de restauración, que mejora el atractivo y favorece la actividad turística y el empleo en la ciudad.",null,null,null,"O.04 Programas de fomento de la expansión de empresas y la promoción exterior de productos locales, en un contexto de globalización."]
[]
[null,null,"F.05 Reconocimiento nacional e internacional de las ciudades españolas, una “marca ciudad” que se vincula a un conjunto valores positivos en la percepción de su calidad.",null,null,null,"O.05 Estrategias de potenciación de la industria agroalimentaria y del sector logístico, para diversificar y fomentar la actividad económica con los recursos del entorno rural."]
[]
[null,null,"F.06 Capacidad de atracción de inversión y capital, que puede acarrear una mejora en la oferta de empleo para los ciudadanos.",null,null,null,"O.06 Programas de fomento del emprendimiento, en especial dirigido a los jóvenes o a colectivos caracterizados por un mayor déficit en formación para el empleo."]
[]
[null,null,"F.07 Capacidad de creación de empleo en sectores altamente especializados como, por ejemplo, la aeronáutica, la construcción naval o la industria farmacéutica.",null,null,null,"O.07 Potencial turístico sin explotar, vinculado a determinados activos o recursos que requieren de actuaciones de rehabilitación, reforma y puesta en valor."]
[]
[null,null,"F.08 Fuerte dinamismo empresarial en algunas áreas urbanas, que incide en un incremento en el número de empresas, capacidad emprendedora y asociacionismo empresarial.",null,null,null,"O.08 Acciones de Impulso de la actividad económica mediante la integración y desarrollo de grandes infraestructuras, como puertos comerciales o aeropuertos."]
[]
[null,null,null,null,null,null,"O.09 Políticas de desconcentración y desestacionalización del turismo."]
[]
[]
[]
[]
[{"$f":"TABLAS!$AL$2","v":"BASES PARA LA ELABORACIÓN DE UNA ESTRATEGIA DE REHABILITACIÓN DEL ENTORNO CONSTRUIDO"}]
[null,null,null,null,null,null,{"$f":"IF($G$2=\"\",\"\",$G$2)","v":"ETAPA II: ANÁLISIS Y DIAGNÓSTICO"}]
[null,null,null,null,null,null,{"$f":"TABLAS!$AL$4","v":""}]
[{"$f":"IF((COUNTA(A367:A385,E367:E385,A391:A408,E391:E408)>0),\"þ\",\"\")","v":""},null,"EJE 8. VIVIENDA"]
["DEBILIDADES",null,null,null,"AMENAZAS"]
[]
[null,null,"D.01 Dificultades de acceso a la vivienda como consecuencia del elevado precio, la escasez de oferta adecuada o la insuficiencia de ayudas locales.",null,null,null,"A.01 Efectos de la crisis económica, que ha afectado especialmente a la construcción del parque residencial, provocando una escasez de vivienda nueva o rehabilitada."]
[]
[null,null,"D.02 Escasez de vivienda social a precio asequible, con un insuficiente número de viviendas sujetas a protección pública para hogares con bajos niveles de renta.",null,null,null,"A.02 Desequilibrios en los cascos históricos de las ciudades entre residentes y visitantes que pueden afectar al acceso a la vivienda, con fenómenos como la gentrificación."]
[]
[null,null,"D.03 Baja eficiencia energética, deficiente conservación y problemas de accesibilidad en una gran parte del parque edificatorio y, en particular, en el parque de vivienda.",null,null,null,"A.03 Dificultades para acceder a la vivienda de la población joven, lo que dificulta la emancipación y la formación de nuevos hogares."]
[]
[null,null,"D.04 Existencia de ámbitos de infravivienda o asentamientos irregulares, con problemas de chabolismo y asentamientos irregulares en determinados entornos urbanos.",null,null,null,"A.04 Inadecuación del parque de vivienda existente a las personas mayores, en el marco de un fenómeno de envejecimiento de la población."]
[]
[null,null,"D.05 Condicionantes específicos del entorno que suponen barreras a la edificación o rehabilitación, como puede ser el caso de los entornos de elevada riqueza arqueológica.",null,null,null,"A.05 Complejidad y dispersión normativa a nivel supramunicipal, en materias como la accesibilidad, la eficiencia energética o la protección del patrimonio."]
[]
[null,null,null,null,null,null,"A.06 Dificultad de las diferentes Administraciones Públicas para mantener y gestionar los Parques Públicos de Vivienda."]
[]
[]
[]
[]
[]
[]
[]
[]
[]
[]
[]
["FORTALEZAS",null,null,null,"OPORTUNIDADES"]
[]
[null,null,"F.01 Actuaciones recientes de rehabilitación edificatoria del parque de viviendas, en el marco de programas públicos de ayudas a nivel local.",null,null,null,"O.01 Programas y políticas autonómicas, nacionales y europeas de fomento de la rehabilitación, regeneración y renovación urbana."]
[]
[null,null,"F.02 Elevada cualificación y conocimiento en la promoción de vivienda protegida, a través de experiencias anteriores llevadas a cabo en la ciudad.",null,null,null,"O.02 Políticas públicas y programas de promoción de energías renovables y la eficiencia energética en la edificación y en las viviendas."]
[]
[null,null,"F.03 Capacidad de atracción de la inversión productiva y de capital al sector de la construcción y la promoción inmobiliaria en el área urbana.",null,null,null,"O.03 Programas nacionales, autonómicos y locales en materia de vivienda, como marco para la aprobación de incentivos para la oferta de vivienda en alquiler a precio asequible."]
[]
[null,null,"F.04 Actuaciones integradas de vivienda y suelo en zonas urbanas degradadas, en las que se han llevado a cabo acciones de mejora social, económica y ambiental.",null,null,null,"O.04 Reorientación del sector de la construcción hacia la rehabilitación edificatoria, caracterizado por su mayor resistencia a los efectos de la crisis económica."]
[]
[null,null,"F.05 Incremento del uso residencial del centro urbano, como resultado de operaciones de regeneración o renovación urbanas desarrolladas en dichos entornos.",null,null,null,"O.05 Actuaciones de promoción de vivienda protegida tanto de nueva construcción, como especialmente, de rehabilitación para satisfacer la demanda de vivienda."]
[]
[null,null,"F.06 Ajuste generalizado del nivel de precios de la vivienda, y del conjunto del mercado inmobiliario en comparación con los máximos alcanzados en 2006 y 2007.",null,null,null,"O.06 Fuentes de financiación para la mejora y conservación del patrimonio y del parque edificatorio en zonas históricas de las ciudades."]
[]
[]
[]
[]
[]
[]
[]
[]
[]
[]
[{"$f":"TABLAS!$AL$2","v":"BASES PARA LA ELABORACIÓN DE UNA ESTRATEGIA DE REHABILITACIÓN DEL ENTORNO CONSTRUIDO"}]
[null,null,null,null,null,null,{"$f":"IF($G$2=\"\",\"\",$G$2)","v":"ETAPA II: ANÁLISIS Y DIAGNÓSTICO"}]
[null,null,null,null,null,null,{"$f":"TABLAS!$AL$4","v":""}]
[{"$f":"IF((COUNTA(A418:A436,E418:E436,A442:A460,E442:E460)>0),\"þ\",\"\")","v":""},null,"EJE 9. ERA DIGITAL"]
["DEBILIDADES",null,null,null,"AMENAZAS"]
[]
[null,null,"D.01 Insuficiente ritmo de incorporación de las TIC en el ámbito local, especialmente en el entorno económico y en materia de gobernanza.",null,null,null,"A.01 Falta de interés del sector empresarial por adaptar las actuales áreas de negocio a las nuevas tecnologías, lo que puede repercutir en su capacidad de adaptación."]
[]
[null,null,"D.02 Falta de servicios de administración electrónica, que incide en el modelo de gobernanza local, en la participación ciudadana y en su empoderamiento.",null,null,null,"A.02 Aumento del peso de la denominada cuarta edad, que se configurará como un colectivo social con especiales dificultades para el acceso a las nuevas tecnologías."]
[]
[null,null,"D.03 Brecha digital en sectores de la población, por la insuficiencia o inadecuación de la red acceso a Internet o por la inexistencia de servicios digitales adecuados.",null,null,null,"A.03 Escasa utilización, con carácter general, de la Administración electrónica y de las aplicaciones municipales por parte de los ciudadanos."]
[]
[null,null,"D.04 Escasa formación de la población en la utilización de las tecnologías de la información, con serias implicaciones y consecuencias en materia de competitividad local.",null,null,null,"A.04 Escasez de recursos económicos para mantener y transformar los servicios que presta la Administración electrónica a nivel local."]
[]
[null,null,"D.05 Escasa incorporación de las TICS en la gestión urbana, especialmente, en algunas ciudades en las que no se ha avanzado hacia Smart Cities en los distintos ámbitos.",null,null,null,"A.05 Bajo aprovechamiento de las TIC como elemento de cohesión social y de mejora de las oportunidades de los colectivos más desfavorecidos."]
[]
[null,null,"D.06 Insuficiente penetración de la firma electrónica en la sociedad.",null,null,null,"A.06 Problemas asociados a la “sociedad digital”: plataformas online para alojamiento, actividades informales o delictivas, control de datos, restricciones de libertad…"]
[]
[null,null,"D.07 Insuficiente nivel de digitalización de los destinos y territorios turísticos para hacer frente a las necesidades de visitantes nacionales e internacionales crecientemente tecnificados.",null,null,null,"A.07 Desajuste entre las nuevas demandas y las soluciones (inmobiliarias, normativas, de stock), y aparición de demandas que requieren nuevas ofertas (tipos, reglas…)."]
[]
[]
[]
[]
[]
[]
[]
[]
[]
["FORTALEZAS",null,null,null,"OPORTUNIDADES"]
[]
[null,null,"F.01 Iniciativas locales de impulso de la gestión de servicios TIC, administración electrónica, uso de redes sociales para informar y dar servicio a los ciudadanos, entre otros.",null,null,null,"O.01 Mejora de la eficiencia en los servicios locales a través de la Administración electrónica local, con una simplificación de trámites administrativos y reducción de costes."]
[]
[null,null,"F.02 Pertenencia de numerosas ciudades españolas a la red de Smart Cities, lo que pone de manifiesto el interés por la modernización de la administración local.",null,null,null,"O.02 Consolidación de la imagen de la ciudad como Smart City, con gran potencial de desarrollo para la implementación de medidas en todos sus ámbitos."]
[]
[null,null,"F.03 Buena competitividad de las empresas vinculadas a las TIC y a la I+D+i, lo que supone un elemento clave para la orientación estratégica del tejido productivo local.",null,null,null,"O.03 Oportunidad de aprovechar el talento formado en el ámbito universitario, como palanca para impulsar la innovación y la transformación de la ciudad."]
[]
[null,null,"F.04 Existencia de un tejido industrial con perfil adaptado a la innovación, por la proximidad de parques científicos o tecnológicos o centros de innovación.",null,null,null,"O.04 Lograr un mayor trabajo en red de Administración, empresas y ciudadanos, a través de nuevas estrategias de comunicación en la era digital."]
[]
[null,null,"F.05 Motivación ciudadana para la utilización de las TICs, en un contexto de interés y extensión de nuevas iniciativas y proyectos, por ejemplo, en el ámbito de la movilidad.",null,null,null,"O.05 Iniciativas para el uso de las TIC en la actividad turística y favorecer la dinamización del turismo industrial o de negocios asociado a la oferta tecnológica e industrial."]
[]
[null,null,null,null,null,null,"O.06 Fomentar el uso de las TIC entre la población, a través de la realización de campañas de información para su utilización o cursos de formación a determinados colectivos."]
[]
[null,null,null,null,null,null,"O.07 Potenciar la innovación en sectores tradicionales, especialmente en el sector comercial de tamaño medio y pequeño, a través de una mayor introducción las TIC."]
[]
[null,null,null,null,null,null,"O.08 Importante recorrido de mejora en el nivel de digitalización de los territorios, que permitirá una mejor gestión de los servicios."]
[]
[]
[]
[]
[]
[]
[{"$f":"TABLAS!$AL$2","v":"BASES PARA LA ELABORACIÓN DE UNA ESTRATEGIA DE REHABILITACIÓN DEL ENTORNO CONSTRUIDO"}]
[null,null,null,null,null,null,{"$f":"IF($G$2=\"\",\"\",$G$2)","v":"ETAPA II: ANÁLISIS Y DIAGNÓSTICO"}]
[null,null,null,null,null,null,{"$f":"TABLAS!$AL$4","v":""}]
[{"$f":"IF((COUNTA(A469:A487,E469:E487,A493:A510,E493:E510)>0),\"þ\",\"\")","v":""},null,"EJE 10. INSTRUMENTOS Y GOBERNANZA"]
["DEBILIDADES",null,null,null,"AMENAZAS"]
[]
[null,null,"D.01 Sistema normativo complejo y heterogéneo en materia urbanística, que dificulta la aplicación de los distintos planes y la gestión urbanística local.",null,null,null,"A.01 Falta de flexibilidad en los instrumentos de planificación, para adaptar los planes a nuevas demandas o necesidades no previstas, que puedan surgir en la ciudad."]
[]
[null,null,"D.02 Excesiva extensión de los plazos de tramitación de planes urbanísticos, produciendo un desfase entre la aplicación de los planes y las necesidades previstas en los mismos.",null,null,null,"A.02 Planificación territorial insuficiente o deficiente, con una ausencia de coordinación entre instrumentos de carácter supramunicipal e instrumentos locales."]
[]
[null,null,"D.03 Estructura y capacidad de las Entidades Locales insuficiente para acceder a fuentes de financiación, así como para su gestión.",null,null,null,"A.03 Rigidez normativa y administrativa para la reutilización de dotaciones y espacios públicos, y para la inserción de nuevos usos en caso de “infrautilización”."]
[]
[null,null,null,null,null,null,"A.04 Difícil convivencia de las distintas planificaciones sectoriales y la planificación local."]
[]
[]
[]
[]
[]
[]
[]
[]
[]
[]
[]
[]
[]
[]
[]
["FORTALEZAS",null,null,null,"OPORTUNIDADES"]
[]
[null,null,"F.01 Experiencia en iniciativas de desarrollo sostenible y utilización de instrumentos de planificación urbanística y territorial.",null,null,null,"O.01 Políticas autonómicas y nacionales en relación a la rehabilitación, regeneración y renovación urbana que fomentan un desarrollo urbano sostenible."]
[]
[null,null,"F.02 Existencia de Instituciones y estructuras que generan procesos de innovación y de creatividad, como el ámbito universitario y académico o de la investigación aplicada.",null,null,null,"O.02 Mejora de la eficiencia en los servicios locales a través de la Administración electrónica local, con una simplificación de trámites administrativos y reducción de costes."]
[]
[null,null,"F.03 Existencia de Planes municipales en algunas ciudades para la rehabilitación urbana y de viviendas, con frecuencia, orientados a la intervención en determinadas zonas urbanas.",null,null,null,"O.03 Elaboración de nuevos Planes Territoriales Integrados e instrumentos de ordenación del territorio en zonas de nuevas sinergias e influencias entre ciudades."]
[]
[null,null,"F.04 Revisión de los instrumentos de planeamiento urbanístico, para su adecuación a la realidad actual, incluyendo en ocasiones iniciativas de desclasificación de suelo.",null,null,null,"O.04 Procurar una mayor imbricación entre las políticas y perspectivas de actuación de la ciudad y del territorio (movilidad, medio ambiente, turismo…)."]
[]
[null,null,"F.05 Modelo descentralizado español, que permite a las Administraciones Públicas adaptarse a las necesidades y al modelo urbano específico.",null,null,null,"O.05 Utilización de la Agenda Urbana Española para integrar y conciliar las políticas, planes, programas y actuaciones relacionadas con los distintos objetivos estratégicos."]
[]
[null,null,"F.06 Existencia de políticas, planes, programas y actuaciones relacionadas con los distintos ejes estratégicos de esta Agenda Urbana Española.",null,null,null,"O.06 Iniciativas para integración de las TIC en la gestión de los destinos turísticos para mejorar su planificación."]
[]
[null,null,"F.07 Existencia de un Programa Nacional de Destinos Turísticos Inteligentes para la mejora de la gobernanza y competitividad de los destinos turísticos en España."]

{"sheet":"ETAPA II.i","index":7,"n_rows":9,"n_cols":5,"rows_kept":9,"cut":false,"hidden":false,"merged":[[2,2,2,4],[9,0,53,4],[5,0,5,4],[6,0,6,4]]}
[null,null,null,null,{"$f":"TABLAS!$AL$2","v":"BASES PARA LA ELABORACIÓN DE UNA ESTRATEGIA DE REHABILITACIÓN DEL ENTORNO CONSTRUIDO"}]
[null,null,null,null,{"$f":"TABLAS!$AL$5","v":"ETAPA II: ANÁLISIS Y DIAGNÓSTICO"}]
[null,null,{"$f":"TABLAS!$AL$4","v":""}]
["II.i  Conclusiones extraídas del proceso participativo"]
[]
["¿Se ha alcanzado un elevado grado de consenso con las diferentes administraciones actuantes, así como con los sectores involucrados de la sociedad civil (asociaciones vecinales y ciudadanas, banca, empresas del sector, etc.) para el desarrollo de las actuaciones?"]
[]
[]
["Conclusiones:"]

{"sheet":"ETAPA III.a","index":8,"n_rows":224,"n_cols":15,"rows_kept":224,"cut":false,"hidden":false,"merged":[[0,0,0,9],[5,1,5,4],[9,1,9,4],[3,8,3,9],[7,3,7,4],[9,6,9,9],[2,4,2,9],[21,3,21,4],[23,1,23,4],[23,6,23,9],[26,1,26,4],[28,3,28,4],[12,1,12,4],[14,3,14,4],[16,1,16,4],[16,6,16,9],[19,1,19,4],[40,1,40,4],[42,3,42,4],[44,1,44,4],[44,6,44,9],[46,0,46,9],[30,1,30,4],[30,6,30,9],[33,1,33,4],[35,3,35,4],[37,1,37,4],[37,6,37,9],[57,1,57,4],[59,3,59,4],[61,1,61,4],[61,6,61,9],[64,1,64,4],[50,1,50,4],[52,3,52,4],[54,1,54,4],[54,6,54,9],[75,1,75,4],[75,6,75,9],[78,1,78,4],[80,3,80,4],[82,1,82,4],[82,6,82,9],[66,3,66,4],[68,1,68,4],[68,6,68,9],[71,1,71,4],[73,3,73,4],[95,1,95,4],[97,3,97,4],[99,1,99,4],[99,6,99,9],[85,1,85,4],[87,3,87,4],[89,1,89,4],[89,6,89,9],[91,0,91,9],[111,3,111,4],[113,1,113,4],[113,6,113,9],[116,1,116,4],[118,3,118,4],[102,1,102,4],[104,3,104,4],[106,1,106,4],[106,6,106,9],[109,1,109,4],[130,1,130,4],[132,3,132,4],[134,1,134,4],[134,6,134,9],[136,0,136,9],[120,1,120,4],[120,6,120,9],[123,1,123,4],[125,3,125,4],[127,1,127,4],[127,6,127,9],[147,1,147,4],[149,3,149,4],[151,1,151,4],[151,6,151,9],[154,1,154,4],[140,1,140,4],[142,3,142,4],[144,1,144,4],[144,6,144,9],[165,1,165,4],[165,6,165,9],[168,1,168,4],[170,3,170,4],[172,1,172,4],[172,6,172,9],[156,3,156,4],[158,1,158,4],[158,6,158,9],[161,1,161,4],[163,3,163,4],[185,1,185,4],[187,3,187,4],[189,1,189,4],[189,6,189,9],[175,1,175,4],[177,3,177,4],[179,1,179,4],[179,6,179,9],[181,0,181,9],[48,4,48,9],[93,4,93,9],[138,4,138,9],[183,4,183,9],[220,1,220,4],[222,3,222,4],[224,1,224,4],[224,6,224,9],[210,1,210,4],[210,6,210,9],[213,1,213,4],[215,3,215,4],[217,1,217,4],[217,6,217,9],[201,3,201,4],[203,1,203,4],[203,6,203,9],[206,1,206,4],[208,3,208,4],[192,1,192,4],[194,3,194,4],[196,1,196,4],[196,6,196,9],[199,1,199,4]]}
[{"$f":"TABLAS!$AL$2","v":"BASES PARA LA ELABORACIÓN DE UNA ESTRATEGIA DE REHABILITACIÓN DEL ENTORNO CONSTRUIDO"},null,null,null,null,null,null,null,null,null,"OCULTAR","OCULTAR","OCULTAR","OCULTAR","OCULTAR"]
[null,null,null,null,null,null,null,null,null,{"$f":"TABLAS!$AL$6","v":"ETAPA III: PROGRAMA DE ACTUACIONES"}]
[null,null,null,null,{"$f":"TABLAS!$AL$4","v":""}]
["III.a   Acciones",null,null,null,null,null,null,"Nº de acciones:",6]
["Cód.","Acción: Objetivo y resultados",null,null,null,"Prioridad","Presupuesto","Año de inicio","Trimestre de inicio","Duración\nTrimestres","Acción","€/trimestre","COL inicio","COL final","CONTROL III.a"]
[{"$f":"CONCATENATE(\"A.\",K6)","v":"A.1"},null,null,null,null,null,null,null,null,null,1,{"$f":"IFERROR(G6/J6,\"\")","v":""},{"$f":"MATCH(H6,'ETAPA III.b'!B$9:AO$9,0)+COLUMN('ETAPA III.b'!A$7)+RIGHT(I6,1)-1","v":{"$error":"#N/A"}},{"$f":"MATCH(H6,'ETAPA III.b'!B$9:AO$9,0)+COLUMN('ETAPA III.b'!A$7)+RIGHT(I6,1)-1+J6-1","v":{"$error":"#N/A"}},{"$f":"OR($I$4<K6,COUNTA(B6:J6,B8)=7)","v":false}]
[null,"DAFO",null,"Líneas de actuación"]
[null,null,null,{"$f":"_xlfn.TEXTJOIN(\", \",TRUE,IF(INDIRECT(CONCATENATE(\"'ETAPA III.a_'!\",SUBSTITUTE(ADDRESS(1,MATCH(A6,'ETAPA III.a_'!$5:$5,0),4),1,\"\"),\":\",SUBSTITUTE(ADDRESS(1,MATCH(A6,'ETAPA III.a_'!$5:$5,0),4),1,\"\")))=\"X\",'ETAPA III.a_'!A:A,\"\"))","v":""},null,null,null,null,null,{"$f":"IFERROR(IF(N6>41,\"Error: El final de esta acción sobrepasa el T4 de 2030.\",IF(O6=FALSE,\"Error: Faltan datos por rellenar de esta acción.\",\"\")),IF(O6=FALSE,\"Error: Faltan datos por rellenar de esta acción.\",\"\"))","v":"Error: Faltan datos por rellenar de esta acción."}]
[null,"Relación de la acción con las debilidades, amenaza, fortalezas u oportunidades del DAFO",null,null,null,null,"Fuentes de financiación previstas"]
[]
[]
["Cód.","Acción: Objetivo y resultados",null,null,null,"Prioridad","Presupuesto","Año de inicio","Trimestre de inicio","Duración\nTrimestres"]
[{"$f":"CONCATENATE(\"A.\",K13)","v":"A.2"},null,null,null,null,null,null,null,null,null,{"$f":"K6+1","v":2},{"$f":"IFERROR(G13/J13,\"\")","v":""},{"$f":"MATCH(H13,'ETAPA III.b'!B$9:AO$9,0)+COLUMN('ETAPA III.b'!A$7)+RIGHT(I13,1)-1","v":{"$error":"#N/A"}},{"$f":"MATCH(H13,'ETAPA III.b'!B$9:AO$9,0)+COLUMN('ETAPA III.b'!A$7)+RIGHT(I13,1)-1+J13-1","v":{"$error":"#N/A"}},{"$f":"OR($I$4<K13,COUNTA(B13:J13,B15)=7)","v":false}]
[null,"DAFO",null,"Líneas de actuación"]
[null,null,null,{"$f":"_xlfn.TEXTJOIN(\", \",TRUE,IF(INDIRECT(CONCATENATE(\"'ETAPA III.a_'!\",SUBSTITUTE(ADDRESS(1,MATCH(A13,'ETAPA III.a_'!$5:$5,0),4),1,\"\"),\":\",SUBSTITUTE(ADDRESS(1,MATCH(A13,'ETAPA III.a_'!$5:$5,0),4),1,\"\")))=\"X\",'ETAPA III.a_'!A:A,\"\"))","v":""},null,null,null,null,null,{"$f":"IFERROR(IF(N13>41,\"Error: El final de esta acción sobrepasa el T4 de 2030.\",IF(O13=FALSE,\"Error: Faltan datos por rellenar de esta acción.\",\"\")),IF(O13=FALSE,\"Error: Faltan datos por rellenar de esta acción.\",\"\"))","v":"Error: Faltan datos por rellenar de esta acción."}]
[null,"Relación de la acción con las debilidades, amenaza, fortalezas u oportunidades del DAFO",null,null,null,null,"Fuentes de financiación previstas"]
[]
[]
["Cód.","Acción: Objetivo y resultados",null,null,null,"Prioridad","Presupuesto","Año de inicio","Trimestre de inicio","Duración\nTrimestres"]
[{"$f":"CONCATENATE(\"A.\",K20)","v":"A.3"},null,null,null,null,null,null,null,null,null,{"$f":"K13+1","v":3},{"$f":"IFERROR(G20/J20,\"\")","v":""},{"$f":"MATCH(H20,'ETAPA III.b'!B$9:AO$9,0)+COLUMN('ETAPA III.b'!A$7)+RIGHT(I20,1)-1","v":{"$error":"#N/A"}},{"$f":"MATCH(H20,'ETAPA III.b'!B$9:AO$9,0)+COLUMN('ETAPA III.b'!A$7)+RIGHT(I20,1)-1+J20-1","v":{"$error":"#N/A"}},{"$f":"OR($I$4<K20,COUNTA(B20:J20,B22)=7)","v":false}]
[null,"DAFO",null,"Líneas de actuación"]
[null,null,null,{"$f":"_xlfn.TEXTJOIN(\", \",TRUE,IF(INDIRECT(CONCATENATE(\"'ETAPA III.a_'!\",SUBSTITUTE(ADDRESS(1,MATCH(A20,'ETAPA III.a_'!$5:$5,0),4),1,\"\"),\":\",SUBSTITUTE(ADDRESS(1,MATCH(A20,'ETAPA III.a_'!$5:$5,0),4),1,\"\")))=\"X\",'ETAPA III.a_'!A:A,\"\"))","v":""},null,null,null,null,null,{"$f":"IFERROR(IF(N20>41,\"Error: El final de esta acción sobrepasa el T4 de 2030.\",IF(O20=FALSE,\"Error: Faltan datos por rellenar de esta acción.\",\"\")),IF(O20=FALSE,\"Error: Faltan datos por rellenar de esta acción.\",\"\"))","v":"Error: Faltan datos por rellenar de esta acción."}]
[null,"Relación de la acción con las debilidades, amenaza, fortalezas u oportunidades del DAFO",null,null,null,null,"Fuentes de financiación previstas"]
[]
[]
["Cód.","Acción: Objetivo y resultados",null,null,null,"Prioridad","Presupuesto","Año de inicio","Trimestre de inicio","Duración\nTrimestres"]
[{"$f":"CONCATENATE(\"A.\",K27)","v":"A.4"},null,null,null,null,null,null,null,null,null,{"$f":"K20+1","v":4},{"$f":"IFERROR(G27/J27,\"\")","v":""},{"$f":"MATCH(H27,'ETAPA III.b'!B$9:AO$9,0)+COLUMN('ETAPA III.b'!A$7)+RIGHT(I27,1)-1","v":{"$error":"#N/A"}},{"$f":"MATCH(H27,'ETAPA III.b'!B$9:AO$9,0)+COLUMN('ETAPA III.b'!A$7)+RIGHT(I27,1)-1+J27-1","v":{"$error":"#N/A"}},{"$f":"OR($I$4<K27,COUNTA(B27:J27,B29)=7)","v":false}]
[null,"DAFO",null,"Líneas de actuación"]
[null,null,null,{"$f":"_xlfn.TEXTJOIN(\", \",TRUE,IF(INDIRECT(CONCATENATE(\"'ETAPA III.a_'!\",SUBSTITUTE(ADDRESS(1,MATCH(A27,'ETAPA III.a_'!$5:$5,0),4),1,\"\"),\":\",SUBSTITUTE(ADDRESS(1,MATCH(A27,'ETAPA III.a_'!$5:$5,0),4),1,\"\")))=\"X\",'ETAPA III.a_'!A:A,\"\"))","v":""},null,null,null,null,null,{"$f":"IFERROR(IF(N27>41,\"Error: El final de esta acción sobrepasa el T4 de 2030.\",IF(O27=FALSE,\"Error: Faltan datos por rellenar de esta acción.\",\"\")),IF(O27=FALSE,\"Error: Faltan datos por rellenar de esta acción.\",\"\"))","v":"Error: Faltan datos por rellenar de esta acción."}]
[null,"Relación de la acción con las debilidades, amenaza, fortalezas u oportunidades del DAFO",null,null,null,null,"Fuentes de financiación previstas"]
[]
[]
["Cód.","Acción: Objetivo y resultados",null,null,null,"Prioridad","Presupuesto","Año de inicio","Trimestre de inicio","Duración\nTrimestres"]
[{"$f":"CONCATENATE(\"A.\",K34)","v":"A.5"},null,null,null,null,null,null,null,null,null,{"$f":"K27+1","v":5},{"$f":"IFERROR(G34/J34,\"\")","v":""},{"$f":"MATCH(H34,'ETAPA III.b'!B$9:AO$9,0)+COLUMN('ETAPA III.b'!A$7)+RIGHT(I34,1)-1","v":{"$error":"#N/A"}},{"$f":"MATCH(H34,'ETAPA III.b'!B$9:AO$9,0)+COLUMN('ETAPA III.b'!A$7)+RIGHT(I34,1)-1+J34-1","v":{"$error":"#N/A"}},{"$f":"OR($I$4<K34,COUNTA(B34:J34,B36)=7)","v":false}]
[null,"DAFO",null,"Líneas de actuación"]
[null,null,null,{"$f":"_xlfn.TEXTJOIN(\", \",TRUE,IF(INDIRECT(CONCATENATE(\"'ETAPA III.a_'!\",SUBSTITUTE(ADDRESS(1,MATCH(A34,'ETAPA III.a_'!$5:$5,0),4),1,\"\"),\":\",SUBSTITUTE(ADDRESS(1,MATCH(A34,'ETAPA III.a_'!$5:$5,0),4),1,\"\")))=\"X\",'ETAPA III.a_'!A:A,\"\"))","v":""},null,null,null,null,null,{"$f":"IFERROR(IF(N34>41,\"Error: El final de esta acción sobrepasa el T4 de 2030.\",IF(O34=FALSE,\"Error: Faltan datos por rellenar de esta acción.\",\"\")),IF(O34=FALSE,\"Error: Faltan datos por rellenar de esta acción.\",\"\"))","v":"Error: Faltan datos por rellenar de esta acción."}]
[null,"Relación de la acción con las debilidades, amenaza, fortalezas u oportunidades del DAFO",null,null,null,null,"Fuentes de financiación previstas"]
[]
[]
["Cód.","Acción: Objetivo y resultados",null,null,null,"Prioridad","Presupuesto","Año de inicio","Trimestre de inicio","Duración\nTrimestres"]
[{"$f":"CONCATENATE(\"A.\",K41)","v":"A.6"},null,null,null,null,null,null,null,null,null,{"$f":"K34+1","v":6},{"$f":"IFERROR(G41/J41,\"\")","v":""},{"$f":"MATCH(H41,'ETAPA III.b'!B$9:AO$9,0)+COLUMN('ETAPA III.b'!A$7)+RIGHT(I41,1)-1","v":{"$error":"#N/A"}},{"$f":"MATCH(H41,'ETAPA III.b'!B$9:AO$9,0)+COLUMN('ETAPA III.b'!A$7)+RIGHT(I41,1)-1+J41-1","v":{"$error":"#N/A"}},{"$f":"OR($I$4<K41,COUNTA(B41:J41,B43)=7)","v":false}]
[null,"DAFO",null,"Líneas de actuación"]
[null,null,null,{"$f":"_xlfn.TEXTJOIN(\", \",TRUE,IF(INDIRECT(CONCATENATE(\"'ETAPA III.a_'!\",SUBSTITUTE(ADDRESS(1,MATCH(A41,'ETAPA III.a_'!$5:$5,0),4),1,\"\"),\":\",SUBSTITUTE(ADDRESS(1,MATCH(A41,'ETAPA III.a_'!$5:$5,0),4),1,\"\")))=\"X\",'ETAPA III.a_'!A:A,\"\"))","v":""},null,null,null,null,null,{"$f":"IFERROR(IF(N41>41,\"Error: El final de esta acción sobrepasa el T4 de 2030.\",IF(O41=FALSE,\"Error: Faltan datos por rellenar de esta acción.\",\"\")),IF(O41=FALSE,\"Error: Faltan datos por rellenar de esta acción.\",\"\"))","v":"Error: Faltan datos por rellenar de esta acción."}]
[null,"Relación de la acción con las debilidades, amenaza, fortalezas u oportunidades del DAFO",null,null,null,null,"Fuentes de financiación previstas"]
[]
[]
[{"$f":"TABLAS!$AL$2","v":"BASES PARA LA ELABORACIÓN DE UNA ESTRATEGIA DE REHABILITACIÓN DEL ENTORNO CONSTRUIDO"}]
[null,null,null,null,null,null,null,null,null,{"$f":"IF($J$2=\"\",\"\",$J$2)","v":"ETAPA III: PROGRAMA DE ACTUACIONES"}]
[null,null,null,null,{"$f":"TABLAS!$AL$4","v":""}]
["Cód.","Acción: Objetivo y resultados",null,null,null,"Prioridad","Presupuesto","Año de inicio","Trimestre de inicio","Duración\nTrimestres"]
[{"$f":"CONCATENATE(\"A.\",K51)","v":"A.7"},null,null,null,null,null,null,null,null,null,{"$f":"K41+1","v":7},{"$f":"IFERROR(G51/J51,\"\")","v":""},{"$f":"MATCH(H51,'ETAPA III.b'!B$9:AO$9,0)+COLUMN('ETAPA III.b'!A$7)+RIGHT(I51,1)-1","v":{"$error":"#N/A"}},{"$f":"MATCH(H51,'ETAPA III.b'!B$9:AO$9,0)+COLUMN('ETAPA III.b'!A$7)+RIGHT(I51,1)-1+J51-1","v":{"$error":"#N/A"}},{"$f":"OR($I$4<K51,COUNTA(B51:J51,B53)=7)","v":true}]
[null,"DAFO",null,"Líneas de actuación"]
[null,null,null,{"$f":"_xlfn.TEXTJOIN(\", \",TRUE,IF(INDIRECT(CONCATENATE(\"'ETAPA III.a_'!\",SUBSTITUTE(ADDRESS(1,MATCH(A51,'ETAPA III.a_'!$5:$5,0),4),1,\"\"),\":\",SUBSTITUTE(ADDRESS(1,MATCH(A51,'ETAPA III.a_'!$5:$5,0),4),1,\"\")))=\"X\",'ETAPA III.a_'!A:A,\"\"))","v":""},null,null,null,null,null,{"$f":"IFERROR(IF(N51>41,\"Error: El final de esta acción sobrepasa el T4 de 2030.\",IF(O51=FALSE,\"Error: Faltan datos por rellenar de esta acción.\",\"\")),IF(O51=FALSE,\"Error: Faltan datos por rellenar de esta acción.\",\"\"))","v":""}]
[null,"Relación de la acción con las debilidades, amenaza, fortalezas u oportunidades del DAFO",null,null,null,null,"Fuentes de financiación previstas"]
[]
[]
["Cód.","Acción: Objetivo y resultados",null,null,null,"Prioridad","Presupuesto","Año de inicio","Trimestre de inicio","Duración\nTrimestres"]
[{"$f":"CONCATENATE(\"A.\",K58)","v":"A.8"},null,null,null,null,null,null,null,null,null,{"$f":"K51+1","v":8},{"$f":"IFERROR(G58/J58,\"\")","v":""},{"$f":"MATCH(H58,'ETAPA III.b'!B$9:AO$9,0)+COLUMN('ETAPA III.b'!A$7)+RIGHT(I58,1)-1","v":{"$error":"#N/A"}},{"$f":"MATCH(H58,'ETAPA III.b'!B$9:AO$9,0)+COLUMN('ETAPA III.b'!A$7)+RIGHT(I58,1)-1+J58-1","v":{"$error":"#N/A"}},{"$f":"OR($I$4<K58,COUNTA(B58:J58,B60)=7)","v":true}]
[null,"DAFO",null,"Líneas de actuación"]
[null,null,null,{"$f":"_xlfn.TEXTJOIN(\", \",TRUE,IF(INDIRECT(CONCATENATE(\"'ETAPA III.a_'!\",SUBSTITUTE(ADDRESS(1,MATCH(A58,'ETAPA III.a_'!$5:$5,0),4),1,\"\"),\":\",SUBSTITUTE(ADDRESS(1,MATCH(A58,'ETAPA III.a_'!$5:$5,0),4),1,\"\")))=\"X\",'ETAPA III.a_'!A:A,\"\"))","v":""},null,null,null,null,null,{"$f":"IFERROR(IF(N58>41,\"Error: El final de esta acción sobrepasa el T4 de 2030.\",IF(O58=FALSE,\"Error: Faltan datos por rellenar de esta acción.\",\"\")),IF(O58=FALSE,\"Error: Faltan datos por rellenar de esta acción.\",\"\"))","v":""}]
[null,"Relación de la acción con las debilidades, amenaza, fortalezas u oportunidades del DAFO",null,null,null,null,"Fuentes de financiación previstas"]
[]
[]
["Cód.","Acción: Objetivo y resultados",null,null,null,"Prioridad","Presupuesto","Año de inicio","Trimestre de inicio","Duración\nTrimestres"]
[{"$f":"CONCATENATE(\"A.\",K65)","v":"A.9"},null,null,null,null,null,null,null,null,null,{"$f":"K58+1","v":9},{"$f":"IFERROR(G65/J65,\"\")","v":""},{"$f":"MATCH(H65,'ETAPA III.b'!B$9:AO$9,0)+COLUMN('ETAPA III.b'!A$7)+RIGHT(I65,1)-1","v":{"$error":"#N/A"}},{"$f":"MATCH(H65,'ETAPA III.b'!B$9:AO$9,0)+COLUMN('ETAPA III.b'!A$7)+RIGHT(I65,1)-1+J65-1","v":{"$error":"#N/A"}},{"$f":"OR($I$4<K65,COUNTA(B65:J65,B67)=7)","v":true}]
[null,"DAFO",null,"Líneas de actuación"]
[null,null,null,{"$f":"_xlfn.TEXTJOIN(\", \",TRUE,IF(INDIRECT(CONCATENATE(\"'ETAPA III.a_'!\",SUBSTITUTE(ADDRESS(1,MATCH(A65,'ETAPA III.a_'!$5:$5,0),4),1,\"\"),\":\",SUBSTITUTE(ADDRESS(1,MATCH(A65,'ETAPA III.a_'!$5:$5,0),4),1,\"\")))=\"X\",'ETAPA III.a_'!A:A,\"\"))","v":""},null,null,null,null,null,{"$f":"IFERROR(IF(N65>41,\"Error: El final de esta acción sobrepasa el T4 de 2030.\",IF(O65=FALSE,\"Error: Faltan datos por rellenar de esta acción.\",\"\")),IF(O65=FALSE,\"Error: Faltan datos por rellenar de esta acción.\",\"\"))","v":""}]
[null,"Relación de la acción con las debilidades, amenaza, fortalezas u oportunidades del DAFO",null,null,null,null,"Fuentes de financiación previstas"]
[]
[]
["Cód.","Acción: Objetivo y resultados",null,null,null,"Prioridad","Presupuesto","Año de inicio","Trimestre de inicio","Duración\nTrimestres"]
[{"$f":"CONCATENATE(\"A.\",K72)","v":"A.10"},null,null,null,null,null,null,null,null,null,{"$f":"K65+1","v":10},{"$f":"IFERROR(G72/J72,\"\")","v":""},{"$f":"MATCH(H72,'ETAPA III.b'!B$9:AO$9,0)+COLUMN('ETAPA III.b'!A$7)+RIGHT(I72,1)-1","v":{"$error":"#N/A"}},{"$f":"MATCH(H72,'ETAPA III.b'!B$9:AO$9,0)+COLUMN('ETAPA III.b'!A$7)+RIGHT(I72,1)-1+J72-1","v":{"$error":"#N/A"}},{"$f":"OR($I$4<K72,COUNTA(B72:J72,B74)=7)","v":true}]
[null,"DAFO",null,"Líneas de actuación"]
[null,null,null,{"$f":"_xlfn.TEXTJOIN(\", \",TRUE,IF(INDIRECT(CONCATENATE(\"'ETAPA III.a_'!\",SUBSTITUTE(ADDRESS(1,MATCH(A72,'ETAPA III.a_'!$5:$5,0),4),1,\"\"),\":\",SUBSTITUTE(ADDRESS(1,MATCH(A72,'ETAPA III.a_'!$5:$5,0),4),1,\"\")))=\"X\",'ETAPA III.a_'!A:A,\"\"))","v":""},null,null,null,null,null,{"$f":"IFERROR(IF(N72>41,\"Error: El final de esta acción sobrepasa el T4 de 2030.\",IF(O72=FALSE,\"Error: Faltan datos por rellenar de esta acción.\",\"\")),IF(O72=FALSE,\"Error: Faltan datos por rellenar de esta acción.\",\"\"))","v":""}]
[null,"Relación de la acción con las debilidades, amenaza, fortalezas u oportunidades del DAFO",null,null,null,null,"Fuentes de financiación previstas"]
[]
[]
["Cód.","Acción: Objetivo y resultados",null,null,null,"Prioridad","Presupuesto","Año de inicio","Trimestre de inicio","Duración\nTrimestres"]
[{"$f":"CONCATENATE(\"A.\",K79)","v":"A.11"},null,null,null,null,null,null,null,null,null,{"$f":"K72+1","v":11},{"$f":"IFERROR(G79/J79,\"\")","v":""},{"$f":"MATCH(H79,'ETAPA III.b'!B$9:AO$9,0)+COLUMN('ETAPA III.b'!A$7)+RIGHT(I79,1)-1","v":{"$error":"#N/A"}},{"$f":"MATCH(H79,'ETAPA III.b'!B$9:AO$9,0)+COLUMN('ETAPA III.b'!A$7)+RIGHT(I79,1)-1+J79-1","v":{"$error":"#N/A"}},{"$f":"OR($I$4<K79,COUNTA(B79:J79,B81)=7)","v":true}]
[null,"DAFO",null,"Líneas de actuación"]
[null,null,null,{"$f":"_xlfn.TEXTJOIN(\", \",TRUE,IF(INDIRECT(CONCATENATE(\"'ETAPA III.a_'!\",SUBSTITUTE(ADDRESS(1,MATCH(A79,'ETAPA III.a_'!$5:$5,0),4),1,\"\"),\":\",SUBSTITUTE(ADDRESS(1,MATCH(A79,'ETAPA III.a_'!$5:$5,0),4),1,\"\")))=\"X\",'ETAPA III.a_'!A:A,\"\"))","v":""},null,null,null,null,null,{"$f":"IFERROR(IF(N79>41,\"Error: El final de esta acción sobrepasa el T4 de 2030.\",IF(O79=FALSE,\"Error: Faltan datos por rellenar de esta acción.\",\"\")),IF(O79=FALSE,\"Error: Faltan datos por rellenar de esta acción.\",\"\"))","v":""}]
[null,"Relación de la acción con las debilidades, amenaza, fortalezas u oportunidades del DAFO",null,null,null,null,"Fuentes de financiación previstas"]
[]
[]
["Cód.","Acción: Objetivo y resultados",null,null,null,"Prioridad","Presupuesto","Año de inicio","Trimestre de inicio","Duración\nTrimestres"]
[{"$f":"CONCATENATE(\"A.\",K86)","v":"A.12"},null,null,null,null,null,null,null,null,null,{"$f":"K79+1","v":12},{"$f":"IFERROR(G86/J86,\"\")","v":""},{"$f":"MATCH(H86,'ETAPA III.b'!B$9:AO$9,0)+COLUMN('ETAPA III.b'!A$7)+RIGHT(I86,1)-1","v":{"$error":"#N/A"}},{"$f":"MATCH(H86,'ETAPA III.b'!B$9:AO$9,0)+COLUMN('ETAPA III.b'!A$7)+RIGHT(I86,1)-1+J86-1","v":{"$error":"#N/A"}},{"$f":"OR($I$4<K86,COUNTA(B86:J86,B88)=7)","v":true}]
[null,"DAFO",null,"Líneas de actuación"]
[null,null,null,{"$f":"_xlfn.TEXTJOIN(\", \",TRUE,IF(INDIRECT(CONCATENATE(\"'ETAPA III.a_'!\",SUBSTITUTE(ADDRESS(1,MATCH(A86,'ETAPA III.a_'!$5:$5,0),4),1,\"\"),\":\",SUBSTITUTE(ADDRESS(1,MATCH(A86,'ETAPA III.a_'!$5:$5,0),4),1,\"\")))=\"X\",'ETAPA III.a_'!A:A,\"\"))","v":""},null,null,null,null,null,{"$f":"IFERROR(IF(N86>41,\"Error: El final de esta acción sobrepasa el T4 de 2030.\",IF(O86=FALSE,\"Error: Faltan datos por rellenar de esta acción.\",\"\")),IF(O86=FALSE,\"Error: Faltan datos por rellenar de esta acción.\",\"\"))","v":""}]
[null,"Relación de la acción con las debilidades, amenaza, fortalezas u oportunidades del DAFO",null,null,null,null,"Fuentes de financiación previstas"]
[]
[]
[{"$f":"TABLAS!$AL$2","v":"BASES PARA LA ELABORACIÓN DE UNA ESTRATEGIA DE REHABILITACIÓN DEL ENTORNO CONSTRUIDO"}]
[null,null,null,null,null,null,null,null,null,{"$f":"IF($J$2=\"\",\"\",$J$2)","v":"ETAPA III: PROGRAMA DE ACTUACIONES"}]
[null,null,null,null,{"$f":"TABLAS!$AL$4","v":""}]
["Cód.","Acción: Objetivo y resultados",null,null,null,"Prioridad","Presupuesto","Año de inicio","Trimestre de inicio","Duración\nTrimestres"]
[{"$f":"CONCATENATE(\"A.\",K96)","v":"A.13"},null,null,null,null,null,null,null,null,null,{"$f":"K86+1","v":13},{"$f":"IFERROR(G96/J96,\"\")","v":""},{"$f":"MATCH(H96,'ETAPA III.b'!B$9:AO$9,0)+COLUMN('ETAPA III.b'!A$7)+RIGHT(I96,1)-1","v":{"$error":"#N/A"}},{"$f":"MATCH(H96,'ETAPA III.b'!B$9:AO$9,0)+COLUMN('ETAPA III.b'!A$7)+RIGHT(I96,1)-1+J96-1","v":{"$error":"#N/A"}},{"$f":"OR($I$4<K96,COUNTA(B96:J96,B98)=7)","v":true}]
[null,"DAFO",null,"Líneas de actuación"]
[null,null,null,{"$f":"_xlfn.TEXTJOIN(\", \",TRUE,IF(INDIRECT(CONCATENATE(\"'ETAPA III.a_'!\",SUBSTITUTE(ADDRESS(1,MATCH(A96,'ETAPA III.a_'!$5:$5,0),4),1,\"\"),\":\",SUBSTITUTE(ADDRESS(1,MATCH(A96,'ETAPA III.a_'!$5:$5,0),4),1,\"\")))=\"X\",'ETAPA III.a_'!A:A,\"\"))","v":""},null,null,null,null,null,{"$f":"IFERROR(IF(N96>41,\"Error: El final de esta acción sobrepasa el T4 de 2030.\",IF(O96=FALSE,\"Error: Faltan datos por rellenar de esta acción.\",\"\")),IF(O96=FALSE,\"Error: Faltan datos por rellenar de esta acción.\",\"\"))","v":""}]
[null,"Relación de la acción con las debilidades, amenaza, fortalezas u oportunidades del DAFO",null,null,null,null,"Fuentes de financiación previstas"]
[]
[]
["Cód.","Acción: Objetivo y resultados",null,null,null,"Prioridad","Presupuesto","Año de inicio","Trimestre de inicio","Duración\nTrimestres"]
[{"$f":"CONCATENATE(\"A.\",K103)","v":"A.14"},null,null,null,null,null,null,null,null,null,{"$f":"K96+1","v":14},{"$f":"IFERROR(G103/J103,\"\")","v":""},{"$f":"MATCH(H103,'ETAPA III.b'!B$9:AO$9,0)+COLUMN('ETAPA III.b'!A$7)+RIGHT(I103,1)-1","v":{"$error":"#N/A"}},{"$f":"MATCH(H103,'ETAPA III.b'!B$9:AO$9,0)+COLUMN('ETAPA III.b'!A$7)+RIGHT(I103,1)-1+J103-1","v":{"$error":"#N/A"}},{"$f":"OR($I$4<K103,COUNTA(B103:J103,B105)=7)","v":true}]
[null,"DAFO",null,"Líneas de actuación"]
[null,null,null,{"$f":"_xlfn.TEXTJOIN(\", \",TRUE,IF(INDIRECT(CONCATENATE(\"'ETAPA III.a_'!\",SUBSTITUTE(ADDRESS(1,MATCH(A103,'ETAPA III.a_'!$5:$5,0),4),1,\"\"),\":\",SUBSTITUTE(ADDRESS(1,MATCH(A103,'ETAPA III.a_'!$5:$5,0),4),1,\"\")))=\"X\",'ETAPA III.a_'!A:A,\"\"))","v":""},null,null,null,null,null,{"$f":"IFERROR(IF(N103>41,\"Error: El final de esta acción sobrepasa el T4 de 2030.\",IF(O103=FALSE,\"Error: Faltan datos por rellenar de esta acción.\",\"\")),IF(O103=FALSE,\"Error: Faltan datos por rellenar de esta acción.\",\"\"))","v":""}]
[null,"Relación de la acción con las debilidades, amenaza, fortalezas u oportunidades del DAFO",null,null,null,null,"Fuentes de financiación previstas"]
[]
[]
["Cód.","Acción: Objetivo y resultados",null,null,null,"Prioridad","Presupuesto","Año de inicio","Trimestre de inicio","Duración\nTrimestres"]
[{"$f":"CONCATENATE(\"A.\",K110)","v":"A.15"},null,null,null,null,null,null,null,null,null,{"$f":"K103+1","v":15},{"$f":"IFERROR(G110/J110,\"\")","v":""},{"$f":"MATCH(H110,'ETAPA III.b'!B$9:AO$9,0)+COLUMN('ETAPA III.b'!A$7)+RIGHT(I110,1)-1","v":{"$error":"#N/A"}},{"$f":"MATCH(H110,'ETAPA III.b'!B$9:AO$9,0)+COLUMN('ETAPA III.b'!A$7)+RIGHT(I110,1)-1+J110-1","v":{"$error":"#N/A"}},{"$f":"OR($I$4<K110,COUNTA(B110:J110,B112)=7)","v":true}]
[null,"DAFO",null,"Líneas de actuación"]
[null,null,null,{"$f":"_xlfn.TEXTJOIN(\", \",TRUE,IF(INDIRECT(CONCATENATE(\"'ETAPA III.a_'!\",SUBSTITUTE(ADDRESS(1,MATCH(A110,'ETAPA III.a_'!$5:$5,0),4),1,\"\"),\":\",SUBSTITUTE(ADDRESS(1,MATCH(A110,'ETAPA III.a_'!$5:$5,0),4),1,\"\")))=\"X\",'ETAPA III.a_'!A:A,\"\"))","v":""},null,null,null,null,null,{"$f":"IFERROR(IF(N110>41,\"Error: El final de esta acción sobrepasa el T4 de 2030.\",IF(O110=FALSE,\"Error: Faltan datos por rellenar de esta acción.\",\"\")),IF(O110=FALSE,\"Error: Faltan datos por rellenar de esta acción.\",\"\"))","v":""}]
[null,"Relación de la acción con las debilidades, amenaza, fortalezas u oportunidades del DAFO",null,null,null,null,"Fuentes de financiación previstas"]
[]
[]
["Cód.","Acción: Objetivo y resultados",null,null,null,"Prioridad","Presupuesto","Año de inicio","Trimestre de inicio","Duración\nTrimestres"]
[{"$f":"CONCATENATE(\"A.\",K117)","v":"A.16"},null,null,null,null,null,null,null,null,null,{"$f":"K110+1","v":16},{"$f":"IFERROR(G117/J117,\"\")","v":""},{"$f":"MATCH(H117,'ETAPA III.b'!B$9:AO$9,0)+COLUMN('ETAPA III.b'!A$7)+RIGHT(I117,1)-1","v":{"$error":"#N/A"}},{"$f":"MATCH(H117,'ETAPA III.b'!B$9:AO$9,0)+COLUMN('ETAPA III.b'!A$7)+RIGHT(I117,1)-1+J117-1","v":{"$error":"#N/A"}},{"$f":"OR($I$4<K117,COUNTA(B117:J117,B119)=7)","v":true}]
[null,"DAFO",null,"Líneas de actuación"]
[null,null,null,{"$f":"_xlfn.TEXTJOIN(\", \",TRUE,IF(INDIRECT(CONCATENATE(\"'ETAPA III.a_'!\",SUBSTITUTE(ADDRESS(1,MATCH(A117,'ETAPA III.a_'!$5:$5,0),4),1,\"\"),\":\",SUBSTITUTE(ADDRESS(1,MATCH(A117,'ETAPA III.a_'!$5:$5,0),4),1,\"\")))=\"X\",'ETAPA III.a_'!A:A,\"\"))","v":""},null,null,null,null,null,{"$f":"IFERROR(IF(N117>41,\"Error: El final de esta acción sobrepasa el T4 de 2030.\",IF(O117=FALSE,\"Error: Faltan datos por rellenar de esta acción.\",\"\")),IF(O117=FALSE,\"Error: Faltan datos por rellenar de esta acción.\",\"\"))","v":""}]
[null,"Relación de la acción con las debilidades, amenaza, fortalezas u oportunidades del DAFO",null,null,null,null,"Fuentes de financiación previstas"]
[]
[]
["Cód.","Acción: Objetivo y resultados",null,null,null,"Prioridad","Presupuesto","Año de inicio","Trimestre de inicio","Duración\nTrimestres"]
[{"$f":"CONCATENATE(\"A.\",K124)","v":"A.17"},null,null,null,null,null,null,null,null,null,{"$f":"K117+1","v":17},{"$f":"IFERROR(G124/J124,\"\")","v":""},{"$f":"MATCH(H124,'ETAPA III.b'!B$9:AO$9,0)+COLUMN('ETAPA III.b'!A$7)+RIGHT(I124,1)-1","v":{"$error":"#N/A"}},{"$f":"MATCH(H124,'ETAPA III.b'!B$9:AO$9,0)+COLUMN('ETAPA III.b'!A$7)+RIGHT(I124,1)-1+J124-1","v":{"$error":"#N/A"}},{"$f":"OR($I$4<K124,COUNTA(B124:J124,B126)=7)","v":true}]
[null,"DAFO",null,"Líneas de actuación"]
[null,null,null,{"$f":"_xlfn.TEXTJOIN(\", \",TRUE,IF(INDIRECT(CONCATENATE(\"'ETAPA III.a_'!\",SUBSTITUTE(ADDRESS(1,MATCH(A124,'ETAPA III.a_'!$5:$5,0),4),1,\"\"),\":\",SUBSTITUTE(ADDRESS(1,MATCH(A124,'ETAPA III.a_'!$5:$5,0),4),1,\"\")))=\"X\",'ETAPA III.a_'!A:A,\"\"))","v":""},null,null,null,null,null,{"$f":"IFERROR(IF(N124>41,\"Error: El final de esta acción sobrepasa el T4 de 2030.\",IF(O124=FALSE,\"Error: Faltan datos por rellenar de esta acción.\",\"\")),IF(O124=FALSE,\"Error: Faltan datos por rellenar de esta acción.\",\"\"))","v":""}]
[null,"Relación de la acción con las debilidades, amenaza, fortalezas u oportunidades del DAFO",null,null,null,null,"Fuentes de financiación previstas"]
[]
[]
["Cód.","Acción: Objetivo y resultados",null,null,null,"Prioridad","Presupuesto","Año de inicio","Trimestre de inicio","Duración\nTrimestres"]
[{"$f":"CONCATENATE(\"A.\",K131)","v":"A.18"},null,null,null,null,null,null,null,null,null,{"$f":"K124+1","v":18},{"$f":"IFERROR(G131/J131,\"\")","v":""},{"$f":"MATCH(H131,'ETAPA III.b'!B$9:AO$9,0)+COLUMN('ETAPA III.b'!A$7)+RIGHT(I131,1)-1","v":{"$error":"#N/A"}},{"$f":"MATCH(H131,'ETAPA III.b'!B$9:AO$9,0)+COLUMN('ETAPA III.b'!A$7)+RIGHT(I131,1)-1+J131-1","v":{"$error":"#N/A"}},{"$f":"OR($I$4<K131,COUNTA(B131:J131,B133)=7)","v":true}]
[null,"DAFO",null,"Líneas de actuación"]
[null,null,null,{"$f":"_xlfn.TEXTJOIN(\", \",TRUE,IF(INDIRECT(CONCATENATE(\"'ETAPA III.a_'!\",SUBSTITUTE(ADDRESS(1,MATCH(A131,'ETAPA III.a_'!$5:$5,0),4),1,\"\"),\":\",SUBSTITUTE(ADDRESS(1,MATCH(A131,'ETAPA III.a_'!$5:$5,0),4),1,\"\")))=\"X\",'ETAPA III.a_'!A:A,\"\"))","v":""},null,null,null,null,null,{"$f":"IFERROR(IF(N131>41,\"Error: El final de esta acción sobrepasa el T4 de 2030.\",IF(O131=FALSE,\"Error: Faltan datos por rellenar de esta acción.\",\"\")),IF(O131=FALSE,\"Error: Faltan datos por rellenar de esta acción.\",\"\"))","v":""}]
[null,"Relación de la acción con las debilidades, amenaza, fortalezas u oportunidades del DAFO",null,null,null,null,"Fuentes de financiación previstas"]
[]
[]
[{"$f":"TABLAS!$AL$2","v":"BASES PARA LA ELABORACIÓN DE UNA ESTRATEGIA DE REHABILITACIÓN DEL ENTORNO CONSTRUIDO"}]
[null,null,null,null,null,null,null,null,null,{"$f":"IF($J$2=\"\",\"\",$J$2)","v":"ETAPA III: PROGRAMA DE ACTUACIONES"}]
[null,null,null,null,{"$f":"TABLAS!$AL$4","v":""}]
["Cód.","Acción: Objetivo y resultados",null,null,null,"Prioridad","Presupuesto","Año de inicio","Trimestre de inicio","Duración\nTrimestres"]
[{"$f":"CONCATENATE(\"A.\",K141)","v":"A.19"},null,null,null,null,null,null,null,null,null,{"$f":"K131+1","v":19},{"$f":"IFERROR(G141/J141,\"\")","v":""},{"$f":"MATCH(H141,'ETAPA III.b'!B$9:AO$9,0)+COLUMN('ETAPA III.b'!A$7)+RIGHT(I141,1)-1","v":{"$error":"#N/A"}},{"$f":"MATCH(H141,'ETAPA III.b'!B$9:AO$9,0)+COLUMN('ETAPA III.b'!A$7)+RIGHT(I141,1)-1+J141-1","v":{"$error":"#N/A"}},{"$f":"OR($I$4<K141,COUNTA(B141:J141,B143)=7)","v":true}]
[null,"DAFO",null,"Líneas de actuación"]
[null,null,null,{"$f":"_xlfn.TEXTJOIN(\", \",TRUE,IF(INDIRECT(CONCATENATE(\"'ETAPA III.a_'!\",SUBSTITUTE(ADDRESS(1,MATCH(A141,'ETAPA III.a_'!$5:$5,0),4),1,\"\"),\":\",SUBSTITUTE(ADDRESS(1,MATCH(A141,'ETAPA III.a_'!$5:$5,0),4),1,\"\")))=\"X\",'ETAPA III.a_'!A:A,\"\"))","v":""},null,null,null,null,null,{"$f":"IFERROR(IF(N141>41,\"Error: El final de esta acción sobrepasa el T4 de 2030.\",IF(O141=FALSE,\"Error: Faltan datos por rellenar de esta acción.\",\"\")),IF(O141=FALSE,\"Error: Faltan datos por rellenar de esta acción.\",\"\"))","v":""}]
[null,"Relación de la acción con las debilidades, amenaza, fortalezas u oportunidades del DAFO",null,null,null,null,"Fuentes de financiación previstas"]
[]
[]
["Cód.","Acción: Objetivo y resultados",null,null,null,"Prioridad","Presupuesto","Año de inicio","Trimestre de inicio","Duración\nTrimestres"]
[{"$f":"CONCATENATE(\"A.\",K148)","v":"A.20"},null,null,null,null,null,null,null,null,null,{"$f":"K141+1","v":20},{"$f":"IFERROR(G148/J148,\"\")","v":""},{"$f":"MATCH(H148,'ETAPA III.b'!B$9:AO$9,0)+COLUMN('ETAPA III.b'!A$7)+RIGHT(I148,1)-1","v":{"$error":"#N/A"}},{"$f":"MATCH(H148,'ETAPA III.b'!B$9:AO$9,0)+COLUMN('ETAPA III.b'!A$7)+RIGHT(I148,1)-1+J148-1","v":{"$error":"#N/A"}},{"$f":"OR($I$4<K148,COUNTA(B148:J148,B150)=7)","v":true}]
[null,"DAFO",null,"Líneas de actuación"]
[null,null,null,{"$f":"_xlfn.TEXTJOIN(\", \",TRUE,IF(INDIRECT(CONCATENATE(\"'ETAPA III.a_'!\",SUBSTITUTE(ADDRESS(1,MATCH(A148,'ETAPA III.a_'!$5:$5,0),4),1,\"\"),\":\",SUBSTITUTE(ADDRESS(1,MATCH(A148,'ETAPA III.a_'!$5:$5,0),4),1,\"\")))=\"X\",'ETAPA III.a_'!A:A,\"\"))","v":""},null,null,null,null,null,{"$f":"IFERROR(IF(N148>41,\"Error: El final de esta acción sobrepasa el T4 de 2030.\",IF(O148=FALSE,\"Error: Faltan datos por rellenar de esta acción.\",\"\")),IF(O148=FALSE,\"Error: Faltan datos por rellenar de esta acción.\",\"\"))","v":""}]
[null,"Relación de la acción con las debilidades, amenaza, fortalezas u oportunidades del DAFO",null,null,null,null,"Fuentes de financiación previstas"]
[]
[]
["Cód.","Acción: Objetivo y resultados",null,null,null,"Prioridad","Presupuesto","Año de inicio","Trimestre de inicio","Duración\nTrimestres"]
[{"$f":"CONCATENATE(\"A.\",K155)","v":"A.21"},null,null,null,null,null,null,null,null,null,{"$f":"K148+1","v":21},{"$f":"IFERROR(G155/J155,\"\")","v":""},{"$f":"MATCH(H155,'ETAPA III.b'!B$9:AO$9,0)+COLUMN('ETAPA III.b'!A$7)+RIGHT(I155,1)-1","v":{"$error":"#N/A"}},{"$f":"MATCH(H155,'ETAPA III.b'!B$9:AO$9,0)+COLUMN('ETAPA III.b'!A$7)+RIGHT(I155,1)-1+J155-1","v":{"$error":"#N/A"}},{"$f":"OR($I$4<K155,COUNTA(B155:J155,B157)=7)","v":true}]
[null,"DAFO",null,"Líneas de actuación"]
[null,null,null,{"$f":"_xlfn.TEXTJOIN(\", \",TRUE,IF(INDIRECT(CONCATENATE(\"'ETAPA III.a_'!\",SUBSTITUTE(ADDRESS(1,MATCH(A155,'ETAPA III.a_'!$5:$5,0),4),1,\"\"),\":\",SUBSTITUTE(ADDRESS(1,MATCH(A155,'ETAPA III.a_'!$5:$5,0),4),1,\"\")))=\"X\",'ETAPA III.a_'!A:A,\"\"))","v":""},null,null,null,null,null,{"$f":"IFERROR(IF(N155>41,\"Error: El final de esta acción sobrepasa el T4 de 2030.\",IF(O155=FALSE,\"Error: Faltan datos por rellenar de esta acción.\",\"\")),IF(O155=FALSE,\"Error: Faltan datos por rellenar de esta acción.\",\"\"))","v":""}]
[null,"Relación de la acción con las debilidades, amenaza, fortalezas u oportunidades del DAFO",null,null,null,null,"Fuentes de financiación previstas"]
[]
[]
["Cód.","Acción: Objetivo y resultados",null,null,null,"Prioridad","Presupuesto","Año de inicio","Trimestre de inicio","Duración\nTrimestres"]
[{"$f":"CONCATENATE(\"A.\",K162)","v":"A.22"},null,null,null,null,null,null,null,null,null,{"$f":"K155+1","v":22},{"$f":"IFERROR(G162/J162,\"\")","v":""},{"$f":"MATCH(H162,'ETAPA III.b'!B$9:AO$9,0)+COLUMN('ETAPA III.b'!A$7)+RIGHT(I162,1)-1","v":{"$error":"#N/A"}},{"$f":"MATCH(H162,'ETAPA III.b'!B$9:AO$9,0)+COLUMN('ETAPA III.b'!A$7)+RIGHT(I162,1)-1+J162-1","v":{"$error":"#N/A"}},{"$f":"OR($I$4<K162,COUNTA(B162:J162,B164)=7)","v":true}]
[null,"DAFO",null,"Líneas de actuación"]
[null,null,null,{"$f":"_xlfn.TEXTJOIN(\", \",TRUE,IF(INDIRECT(CONCATENATE(\"'ETAPA III.a_'!\",SUBSTITUTE(ADDRESS(1,MATCH(A162,'ETAPA III.a_'!$5:$5,0),4),1,\"\"),\":\",SUBSTITUTE(ADDRESS(1,MATCH(A162,'ETAPA III.a_'!$5:$5,0),4),1,\"\")))=\"X\",'ETAPA III.a_'!A:A,\"\"))","v":""},null,null,null,null,null,{"$f":"IFERROR(IF(N162>41,\"Error: El final de esta acción sobrepasa el T4 de 2030.\",IF(O162=FALSE,\"Error: Faltan datos por rellenar de esta acción.\",\"\")),IF(O162=FALSE,\"Error: Faltan datos por rellenar de esta acción.\",\"\"))","v":""}]
[null,"Relación de la acción con las debilidades, amenaza, fortalezas u oportunidades del DAFO",null,null,null,null,"Fuentes de financiación previstas"]
[]
[]
["Cód.","Acción: Objetivo y resultados",null,null,null,"Prioridad","Presupuesto","Año de inicio","Trimestre de inicio","Duración\nTrimestres"]
[{"$f":"CONCATENATE(\"A.\",K169)","v":"A.23"},null,null,null,null,null,null,null,null,null,{"$f":"K162+1","v":23},{"$f":"IFERROR(G169/J169,\"\")","v":""},{"$f":"MATCH(H169,'ETAPA III.b'!B$9:AO$9,0)+COLUMN('ETAPA III.b'!A$7)+RIGHT(I169,1)-1","v":{"$error":"#N/A"}},{"$f":"MATCH(H169,'ETAPA III.b'!B$9:AO$9,0)+COLUMN('ETAPA III.b'!A$7)+RIGHT(I169,1)-1+J169-1","v":{"$error":"#N/A"}},{"$f":"OR($I$4<K169,COUNTA(B169:J169,B171)=7)","v":true}]
[null,"DAFO",null,"Líneas de actuación"]
[null,null,null,{"$f":"_xlfn.TEXTJOIN(\", \",TRUE,IF(INDIRECT(CONCATENATE(\"'ETAPA III.a_'!\",SUBSTITUTE(ADDRESS(1,MATCH(A169,'ETAPA III.a_'!$5:$5,0),4),1,\"\"),\":\",SUBSTITUTE(ADDRESS(1,MATCH(A169,'ETAPA III.a_'!$5:$5,0),4),1,\"\")))=\"X\",'ETAPA III.a_'!A:A,\"\"))","v":""},null,null,null,null,null,{"$f":"IFERROR(IF(N169>41,\"Error: El final de esta acción sobrepasa el T4 de 2030.\",IF(O169=FALSE,\"Error: Faltan datos por rellenar de esta acción.\",\"\")),IF(O169=FALSE,\"Error: Faltan datos por rellenar de esta acción.\",\"\"))","v":""}]
[null,"Relación de la acción con las debilidades, amenaza, fortalezas u oportunidades del DAFO",null,null,null,null,"Fuentes de financiación previstas"]
[]
[]
["Cód.","Acción: Objetivo y resultados",null,null,null,"Prioridad","Presupuesto","Año de inicio","Trimestre de inicio","Duración\nTrimestres"]
[{"$f":"CONCATENATE(\"A.\",K176)","v":"A.24"},null,null,null,null,null,null,null,null,null,{"$f":"K169+1","v":24},{"$f":"IFERROR(G176/J176,\"\")","v":""},{"$f":"MATCH(H176,'ETAPA III.b'!B$9:AO$9,0)+COLUMN('ETAPA III.b'!A$7)+RIGHT(I176,1)-1","v":{"$error":"#N/A"}},{"$f":"MATCH(H176,'ETAPA III.b'!B$9:AO$9,0)+COLUMN('ETAPA III.b'!A$7)+RIGHT(I176,1)-1+J176-1","v":{"$error":"#N/A"}},{"$f":"OR($I$4<K176,COUNTA(B176:J176,B178)=7)","v":true}]
[null,"DAFO",null,"Líneas de actuación"]
[null,null,null,{"$f":"_xlfn.TEXTJOIN(\", \",TRUE,IF(INDIRECT(CONCATENATE(\"'ETAPA III.a_'!\",SUBSTITUTE(ADDRESS(1,MATCH(A176,'ETAPA III.a_'!$5:$5,0),4),1,\"\"),\":\",SUBSTITUTE(ADDRESS(1,MATCH(A176,'ETAPA III.a_'!$5:$5,0),4),1,\"\")))=\"X\",'ETAPA III.a_'!A:A,\"\"))","v":""},null,null,null,null,null,{"$f":"IFERROR(IF(N176>41,\"Error: El final de esta acción sobrepasa el T4 de 2030.\",IF(O176=FALSE,\"Error: Faltan datos por rellenar de esta acción.\",\"\")),IF(O176=FALSE,\"Error: Faltan datos por rellenar de esta acción.\",\"\"))","v":""}]
[null,"Relación de la acción con las debilidades, amenaza, fortalezas u oportunidades del DAFO",null,null,null,null,"Fuentes de financiación previstas"]
[]
[]
[{"$f":"TABLAS!$AL$2","v":"BASES PARA LA ELABORACIÓN DE UNA ESTRATEGIA DE REHABILITACIÓN DEL ENTORNO CONSTRUIDO"}]
[null,null,null,null,null,null,null,null,null,{"$f":"IF($J$2=\"\",\"\",$J$2)","v":"ETAPA III: PROGRAMA DE ACTUACIONES"}]
[null,null,null,null,{"$f":"TABLAS!$AL$4","v":""}]
["Cód.","Acción: Objetivo y resultados",null,null,null,"Prioridad","Presupuesto","Año de inicio","Trimestre de inicio","Duración\nTrimestres"]
[{"$f":"CONCATENATE(\"A.\",K186)","v":"A.25"},null,null,null,null,null,null,null,null,null,{"$f":"K176+1","v":25},{"$f":"IFERROR(G186/J186,\"\")","v":""},{"$f":"MATCH(H186,'ETAPA III.b'!B$9:AO$9,0)+COLUMN('ETAPA III.b'!A$7)+RIGHT(I186,1)-1","v":{"$error":"#N/A"}},{"$f":"MATCH(H186,'ETAPA III.b'!B$9:AO$9,0)+COLUMN('ETAPA III.b'!A$7)+RIGHT(I186,1)-1+J186-1","v":{"$error":"#N/A"}},{"$f":"OR($I$4<K186,COUNTA(B186:J186,B188)=7)","v":true}]
[null,"DAFO",null,"Líneas de actuación"]
[null,null,null,{"$f":"_xlfn.TEXTJOIN(\", \",TRUE,IF(INDIRECT(CONCATENATE(\"'ETAPA III.a_'!\",SUBSTITUTE(ADDRESS(1,MATCH(A186,'ETAPA III.a_'!$5:$5,0),4),1,\"\"),\":\",SUBSTITUTE(ADDRESS(1,MATCH(A186,'ETAPA III.a_'!$5:$5,0),4),1,\"\")))=\"X\",'ETAPA III.a_'!A:A,\"\"))","v":""},null,null,null,null,null,{"$f":"IFERROR(IF(N186>41,\"Error: El final de esta acción sobrepasa el T4 de 2030.\",IF(O186=FALSE,\"Error: Faltan datos por rellenar de esta acción.\",\"\")),IF(O186=FALSE,\"Error: Faltan datos por rellenar de esta acción.\",\"\"))","v":""}]
[null,"Relación de la acción con las debilidades, amenaza, fortalezas u oportunidades del DAFO",null,null,null,null,"Fuentes de financiación previstas"]
[]
[]
["Cód.","Acción: Objetivo y resultados",null,null,null,"Prioridad","Presupuesto","Año de inicio","Trimestre de inicio","Duración\nTrimestres"]
[{"$f":"CONCATENATE(\"A.\",K193)","v":"A.26"},null,null,null,null,null,null,null,null,null,{"$f":"K186+1","v":26},{"$f":"IFERROR(G193/J193,\"\")","v":""},{"$f":"MATCH(H193,'ETAPA III.b'!B$9:AO$9,0)+COLUMN('ETAPA III.b'!A$7)+RIGHT(I193,1)-1","v":{"$error":"#N/A"}},{"$f":"MATCH(H193,'ETAPA III.b'!B$9:AO$9,0)+COLUMN('ETAPA III.b'!A$7)+RIGHT(I193,1)-1+J193-1","v":{"$error":"#N/A"}},{"$f":"OR($I$4<K193,COUNTA(B193:J193,B195)=7)","v":true}]
[null,"DAFO",null,"Líneas de actuación"]
[null,null,null,{"$f":"_xlfn.TEXTJOIN(\", \",TRUE,IF(INDIRECT(CONCATENATE(\"'ETAPA III.a_'!\",SUBSTITUTE(ADDRESS(1,MATCH(A193,'ETAPA III.a_'!$5:$5,0),4),1,\"\"),\":\",SUBSTITUTE(ADDRESS(1,MATCH(A193,'ETAPA III.a_'!$5:$5,0),4),1,\"\")))=\"X\",'ETAPA III.a_'!A:A,\"\"))","v":""},null,null,null,null,null,{"$f":"IFERROR(IF(N193>41,\"Error: El final de esta acción sobrepasa el T4 de 2030.\",IF(O193=FALSE,\"Error: Faltan datos por rellenar de esta acción.\",\"\")),IF(O193=FALSE,\"Error: Faltan datos por rellenar de esta acción.\",\"\"))","v":""}]
[null,"Relación de la acción con las debilidades, amenaza, fortalezas u oportunidades del DAFO",null,null,null,null,"Fuentes de financiación previstas"]
[]
[]
["Cód.","Acción: Objetivo y resultados",null,null,null,"Prioridad","Presupuesto","Año de inicio","Trimestre de inicio","Duración\nTrimestres"]
[{"$f":"CONCATENATE(\"A.\",K200)","v":"A.27"},null,null,null,null,null,null,null,null,null,{"$f":"K193+1","v":27},{"$f":"IFERROR(G200/J200,\"\")","v":""},{"$f":"MATCH(H200,'ETAPA III.b'!B$9:AO$9,0)+COLUMN('ETAPA III.b'!A$7)+RIGHT(I200,1)-1","v":{"$error":"#N/A"}},{"$f":"MATCH(H200,'ETAPA III.b'!B$9:AO$9,0)+COLUMN('ETAPA III.b'!A$7)+RIGHT(I200,1)-1+J200-1","v":{"$error":"#N/A"}},{"$f":"OR($I$4<K200,COUNTA(B200:J200,B202)=7)","v":true}]
[null,"DAFO",null,"Líneas de actuación"]
[null,null,null,{"$f":"_xlfn.TEXTJOIN(\", \",TRUE,IF(INDIRECT(CONCATENATE(\"'ETAPA III.a_'!\",SUBSTITUTE(ADDRESS(1,MATCH(A200,'ETAPA III.a_'!$5:$5,0),4),1,\"\"),\":\",SUBSTITUTE(ADDRESS(1,MATCH(A200,'ETAPA III.a_'!$5:$5,0),4),1,\"\")))=\"X\",'ETAPA III.a_'!A:A,\"\"))","v":""},null,null,null,null,null,{"$f":"IFERROR(IF(N200>41,\"Error: El final de esta acción sobrepasa el T4 de 2030.\",IF(O200=FALSE,\"Error: Faltan datos por rellenar de esta acción.\",\"\")),IF(O200=FALSE,\"Error: Faltan datos por rellenar de esta acción.\",\"\"))","v":""}]
[null,"Relación de la acción con las debilidades, amenaza, fortalezas u oportunidades del DAFO",null,null,null,null,"Fuentes de financiación previstas"]
[]
[]
["Cód.","Acción: Objetivo y resultados",null,null,null,"Prioridad","Presupuesto","Año de inicio","Trimestre de inicio","Duración\nTrimestres"]
[{"$f":"CONCATENATE(\"A.\",K207)","v":"A.28"},null,null,null,null,null,null,null,null,null,{"$f":"K200+1","v":28},{"$f":"IFERROR(G207/J207,\"\")","v":""},{"$f":"MATCH(H207,'ETAPA III.b'!B$9:AO$9,0)+COLUMN('ETAPA III.b'!A$7)+RIGHT(I207,1)-1","v":{"$error":"#N/A"}},{"$f":"MATCH(H207,'ETAPA III.b'!B$9:AO$9,0)+COLUMN('ETAPA III.b'!A$7)+RIGHT(I207,1)-1+J207-1","v":{"$error":"#N/A"}},{"$f":"OR($I$4<K207,COUNTA(B207:J207,B209)=7)","v":true}]
[null,"DAFO",null,"Líneas de actuación"]
[null,null,null,{"$f":"_xlfn.TEXTJOIN(\", \",TRUE,IF(INDIRECT(CONCATENATE(\"'ETAPA III.a_'!\",SUBSTITUTE(ADDRESS(1,MATCH(A207,'ETAPA III.a_'!$5:$5,0),4),1,\"\"),\":\",SUBSTITUTE(ADDRESS(1,MATCH(A207,'ETAPA III.a_'!$5:$5,0),4),1,\"\")))=\"X\",'ETAPA III.a_'!A:A,\"\"))","v":""},null,null,null,null,null,{"$f":"IFERROR(IF(N207>41,\"Error: El final de esta acción sobrepasa el T4 de 2030.\",IF(O207=FALSE,\"Error: Faltan datos por rellenar de esta acción.\",\"\")),IF(O207=FALSE,\"Error: Faltan datos por rellenar de esta acción.\",\"\"))","v":""}]
[null,"Relación de la acción con las debilidades, amenaza, fortalezas u oportunidades del DAFO",null,null,null,null,"Fuentes de financiación previstas"]
[]
[]
["Cód.","Acción: Objetivo y resultados",null,null,null,"Prioridad","Presupuesto","Año de inicio","Trimestre de inicio","Duración\nTrimestres"]
[{"$f":"CONCATENATE(\"A.\",K214)","v":"A.29"},null,null,null,null,null,null,null,null,null,{"$f":"K207+1","v":29},{"$f":"IFERROR(G214/J214,\"\")","v":""},{"$f":"MATCH(H214,'ETAPA III.b'!B$9:AO$9,0)+COLUMN('ETAPA III.b'!A$7)+RIGHT(I214,1)-1","v":{"$error":"#N/A"}},{"$f":"MATCH(H214,'ETAPA III.b'!B$9:AO$9,0)+COLUMN('ETAPA III.b'!A$7)+RIGHT(I214,1)-1+J214-1","v":{"$error":"#N/A"}},{"$f":"OR($I$4<K214,COUNTA(B214:J214,B216)=7)","v":true}]
[null,"DAFO",null,"Líneas de actuación"]
[null,null,null,{"$f":"_xlfn.TEXTJOIN(\", \",TRUE,IF(INDIRECT(CONCATENATE(\"'ETAPA III.a_'!\",SUBSTITUTE(ADDRESS(1,MATCH(A214,'ETAPA III.a_'!$5:$5,0),4),1,\"\"),\":\",SUBSTITUTE(ADDRESS(1,MATCH(A214,'ETAPA III.a_'!$5:$5,0),4),1,\"\")))=\"X\",'ETAPA III.a_'!A:A,\"\"))","v":""},null,null,null,null,null,{"$f":"IFERROR(IF(N214>41,\"Error: El final de esta acción sobrepasa el T4 de 2030.\",IF(O214=FALSE,\"Error: Faltan datos por rellenar de esta acción.\",\"\")),IF(O214=FALSE,\"Error: Faltan datos por rellenar de esta acción.\",\"\"))","v":""}]
[null,"Relación de la acción con las debilidades, amenaza, fortalezas u oportunidades del DAFO",null,null,null,null,"Fuentes de financiación previstas"]
[]
[]
["Cód.","Acción: Objetivo y resultados",null,null,null,"Prioridad","Presupuesto","Año de inicio","Trimestre de inicio","Duración\nTrimestres"]
[{"$f":"CONCATENATE(\"A.\",K221)","v":"A.30"},null,null,null,null,null,null,null,null,null,{"$f":"K214+1","v":30},{"$f":"IFERROR(G221/J221,\"\")","v":""},{"$f":"MATCH(H221,'ETAPA III.b'!B$9:AO$9,0)+COLUMN('ETAPA III.b'!A$7)+RIGHT(I221,1)-1","v":{"$error":"#N/A"}},{"$f":"MATCH(H221,'ETAPA III.b'!B$9:AO$9,0)+COLUMN('ETAPA III.b'!A$7)+RIGHT(I221,1)-1+J221-1","v":{"$error":"#N/A"}},{"$f":"OR($I$4<K221,COUNTA(B221:J221,B223)=7)","v":true}]
[null,"DAFO",null,"Líneas de actuación"]
[null,null,null,{"$f":"_xlfn.TEXTJOIN(\", \",TRUE,IF(INDIRECT(CONCATENATE(\"'ETAPA III.a_'!\",SUBSTITUTE(ADDRESS(1,MATCH(A221,'ETAPA III.a_'!$5:$5,0),4),1,\"\"),\":\",SUBSTITUTE(ADDRESS(1,MATCH(A221,'ETAPA III.a_'!$5:$5,0),4),1,\"\")))=\"X\",'ETAPA III.a_'!A:A,\"\"))","v":""},null,null,null,null,null,{"$f":"IFERROR(IF(N221>41,\"Error: El final de esta acción sobrepasa el T4 de 2030.\",IF(O221=FALSE,\"Error: Faltan datos por rellenar de esta acción.\",\"\")),IF(O221=FALSE,\"Error: Faltan datos por rellenar de esta acción.\",\"\"))","v":""}]
[null,"Relación de la acción con las debilidades, amenaza, fortalezas u oportunidades del DAFO",null,null,null,null,"Fuentes de financiación previstas"]

{"sheet":"ETAPA III.a_","index":9,"n_rows":381,"n_cols":32,"rows_kept":381,"cut":false,"hidden":false,"merged":[[279,11,281,11],[279,12,281,12],[326,29,328,29],[326,30,328,30],[326,31,328,31],[326,20,328,20],[326,21,328,21],[326,22,328,22],[326,23,328,23],[326,24,328,24],[326,25,328,25],[326,26,328,26],[326,27,328,27],[326,28,328,28],[279,24,281,24],[279,25,281,25],[279,13,281,13],[279,14,281,14],[279,20,281,20],[279,21,281,21],[279,22,281,22],[279,23,281,23],[303,27,305,27],[303,28,305,28],[279,2,281,2],[279,3,281,3],[279,17,281,17],[279,18,281,18],[279,19,281,19],[326,4,328,4],[326,5,328,5],[326,6,328,6],[326,7,328,7],[326,8,328,8],[326,9,328,9],[326,10,328,10],[326,11,328,11],[326,12,328,12],[326,13,328,13],[326,14,328,14],[326,15,328,15],[326,16,328,16],[326,17,328,17],[326,18,328,18],[326,19,328,19],[279,6,281,6],[279,7,281,7],[279,8,281,8],[242,31,244,31],[303,2,305,2],[303,3,305,3],[303,4,305,4],[303,5,305,5],[303,6,305,6],[303,7,305,7],[303,8,305,8],[303,9,305,9],[303,10,305,10],[303,11,305,11],[303,12,305,12],[303,13,305,13],[303,14,305,14],[303,15,305,15],[303,16,305,16],[303,17,305,17],[303,18,305,18],[279,15,281,15],[279,16,281,16],[279,9,281,9],[279,10,281,10],[279,4,281,4],[279,5,281,5],[242,23,244,23],[242,24,244,24],[242,25,244,25],[242,26,244,26],[246,7,247,7],[246,8,247,8],[246,9,247,9],[246,10,247,10],[246,11,247,11],[242,11,244,11],[242,12,244,12],[242,13,244,13],[242,14,244,14],[242,15,244,15],[242,16,244,16],[242,27,244,27],[242,28,244,28],[242,29,244,29],[242,30,244,30],[178,8,179,8],[178,9,179,9],[178,10,179,10],[178,11,179,11],[178,12,179,12],[242,18,244,18],[242,19,244,19],[242,20,244,20],[242,21,244,21],[204,9,206,9],[204,10,206,10],[204,11,206,11],[204,12,206,12],[204,13,206,13],[204,14,206,14],[204,15,206,15],[204,16,206,16],[204,17,206,17],[208,10,209,10],[208,11,209,11],[128,27,130,27],[128,28,130,28],[128,29,130,29],[128,30,130,30],[128,31,130,31],[174,2,176,2],[174,3,176,3],[174,4,176,4],[174,5,176,5],[174,6,176,6],[174,7,176,7],[174,8,176,8],[174,9,176,9],[174,10,176,10],[174,11,176,11],[174,12,176,12],[174,13,176,13],[174,14,176,14],[174,15,176,15],[174,16,176,16],[174,17,176,17],[174,18,176,18],[174,19,176,19],[174,20,176,20],[93,30,95,30],[93,31,95,31],[128,2,130,2],[128,3,130,3],[128,4,130,4],[128,5,130,5],[128,6,130,6],[128,7,130,7],[128,8,130,8],[128,9,130,9],[128,10,130,10],[128,11,130,11],[128,12,130,12],[128,13,130,13],[128,14,130,14],[128,15,130,15],[128,16,130,16],[128,17,130,17],[128,21,130,21],[128,22,130,22],[128,23,130,23],[128,24,130,24],[128,25,130,25],[128,26,130,26],[93,20,95,20],[93,21,95,21],[93,22,95,22],[93,24,95,24],[93,25,95,25],[93,26,95,26],[93,27,95,27],[93,28,95,28],[93,29,95,29],[25,26,27,26],[25,27,27,27],[25,28,27,28],[25,29,27,29],[25,30,27,30],[25,31,27,31],[93,2,95,2],[93,3,95,3],[93,4,95,4],[93,5,95,5],[93,6,95,6],[93,7,95,7],[93,8,95,8],[93,9,95,9],[93,10,95,10],[93,11,95,11],[93,12,95,12],[93,13,95,13],[93,14,95,14],[93,15,95,15],[93,16,95,16],[93,17,95,17],[93,18,95,18],[93,19,95,19],[25,2,27,2],[25,3,27,3],[25,4,27,4],[25,5,27,5],[25,6,27,6],[25,7,27,7],[25,8,27,8],[25,9,27,9],[25,10,27,10],[3,0,3,1],[4,2,5,2],[4,3,5,3],[4,4,5,4],[4,5,5,5],[4,6,5,6],[4,20,5,20],[4,21,5,21],[4,30,5,30],[4,24,5,24],[4,25,5,25],[4,26,5,26],[4,27,5,27],[4,28,5,28],[4,29,5,29],[4,7,5,7],[4,8,5,8],[4,9,5,9],[4,23,5,23],[4,22,5,22],[4,19,5,19],[4,11,5,11],[4,12,5,12],[4,13,5,13],[28,0,28,1],[29,2,30,2],[29,3,30,3],[29,4,30,4],[29,5,30,5],[29,6,30,6],[29,7,30,7],[29,8,30,8],[29,9,30,9],[4,14,5,14],[4,15,5,15],[4,10,5,10],[4,16,5,16],[4,17,5,17],[4,18,5,18],[29,27,30,27],[29,28,30,28],[29,29,30,29],[25,11,27,11],[25,12,27,12],[25,13,27,13],[25,14,27,14],[25,15,27,15],[25,16,27,16],[25,17,27,17],[25,18,27,18],[25,19,27,19],[25,20,27,20],[25,21,27,21],[25,22,27,22],[25,23,27,23],[25,24,27,24],[25,25,27,25],[29,30,30,30],[29,31,30,31],[29,22,30,22],[29,10,30,10],[29,11,30,11],[29,15,30,15],[29,16,30,16],[29,23,30,23],[29,24,30,24],[4,31,5,31],[96,0,96,1],[97,2,98,2],[97,3,98,3],[97,4,98,4],[97,5,98,5],[97,6,98,6],[29,25,30,25],[29,26,30,26],[29,17,30,17],[29,18,30,18],[29,19,30,19],[29,20,30,20],[29,21,30,21],[97,7,98,7],[97,8,98,8],[97,9,98,9],[97,10,98,10],[97,11,98,11],[97,12,98,12],[29,12,30,12],[29,13,30,13],[29,14,30,14],[93,23,95,23],[97,16,98,16],[97,17,98,17],[97,18,98,18],[97,13,98,13],[97,14,98,14],[97,15,98,15],[97,31,98,31],[97,26,98,26],[97,27,98,27],[97,29,98,29],[97,30,98,30],[97,21,98,21],[97,22,98,22],[97,28,98,28],[97,19,98,19],[97,20,98,20],[97,23,98,23],[97,24,98,24],[97,25,98,25],[128,18,130,18],[128,19,130,19],[128,20,130,20],[132,25,133,25],[132,26,133,26],[132,17,133,17],[132,18,133,18],[132,19,133,19],[132,20,133,20],[132,21,133,21],[132,22,133,22],[131,0,131,1],[132,9,133,9],[132,10,133,10],[132,11,133,11],[132,2,133,2],[132,3,133,3],[132,4,133,4],[132,5,133,5],[132,6,133,6],[132,7,133,7],[132,8,133,8],[174,23,176,23],[132,29,133,29],[132,30,133,30],[132,31,133,31],[174,24,176,24],[174,25,176,25],[174,26,176,26],[174,27,176,27],[174,28,176,28],[174,29,176,29],[174,30,176,30],[174,31,176,31],[132,23,133,23],[132,24,133,24],[132,27,133,27],[132,28,133,28],[132,16,133,16],[132,15,133,15],[132,12,133,12],[132,13,133,13],[132,14,133,14],[207,0,207,1],[208,2,209,2],[208,3,209,3],[208,4,209,4],[208,5,209,5],[208,6,209,6],[208,7,209,7],[177,0,177,1],[204,2,206,2],[204,3,206,3],[204,4,206,4],[204,5,206,5],[204,6,206,6],[204,7,206,7],[204,8,206,8],[178,2,179,2],[178,3,179,3],[178,4,179,4],[174,21,176,21],[174,22,176,22],[178,5,179,5],[178,6,179,6],[178,7,179,7],[178,19,179,19],[178,20,179,20],[178,21,179,21],[178,22,179,22],[208,31,209,31],[208,23,209,23],[208,24,209,24],[178,25,179,25],[204,31,206,31],[208,27,209,27],[208,28,209,28],[208,29,209,29],[208,30,209,30],[204,23,206,23],[204,24,206,24],[178,24,179,24],[208,25,209,25],[208,26,209,26],[204,22,206,22],[178,13,179,13],[204,18,206,18],[204,19,206,19],[178,31,179,31],[178,26,179,26],[178,27,179,27],[178,28,179,28],[178,29,179,29],[178,30,179,30],[204,21,206,21],[204,25,206,25],[204,26,206,26],[204,27,206,27],[204,28,206,28],[204,29,206,29],[204,30,206,30],[178,23,179,23],[204,20,206,20],[178,16,179,16],[178,17,179,17],[178,18,179,18],[178,14,179,14],[178,15,179,15],[242,2,244,2],[242,3,244,3],[242,4,244,4],[242,5,244,5],[242,6,244,6],[242,7,244,7],[242,8,244,8],[242,9,244,9],[242,10,244,10],[208,20,209,20],[208,21,209,21],[208,22,209,22],[208,8,209,8],[208,9,209,9],[242,17,244,17],[208,12,209,12],[246,21,247,21],[246,12,247,12],[246,13,247,13],[246,14,247,14],[246,15,247,15],[246,16,247,16],[208,13,209,13],[208,14,209,14],[246,17,247,17],[246,18,247,18],[246,19,247,19],[208,17,209,17],[208,18,209,18],[208,19,209,19],[208,15,209,15],[208,16,209,16],[242,22,244,22],[246,27,247,27],[246,28,247,28],[245,0,245,1],[246,29,247,29],[246,30,247,30],[246,31,247,31],[246,22,247,22],[246,23,247,23],[246,24,247,24],[246,25,247,25],[246,26,247,26],[246,20,247,20],[246,2,247,2],[246,3,247,3],[246,4,247,4],[246,5,247,5],[246,6,247,6],[283,8,284,8],[283,9,284,9],[283,10,284,10],[283,11,284,11],[283,12,284,12],[283,13,284,13],[283,29,284,29],[283,30,284,30],[283,31,284,31],[282,0,282,1],[283,2,284,2],[283,3,284,3],[283,4,284,4],[283,5,284,5],[283,6,284,6],[283,7,284,7],[303,24,305,24],[303,25,305,25],[283,24,284,24],[283,25,284,25],[283,19,284,19],[283,20,284,20],[283,21,284,21],[283,22,284,22],[283,23,284,23],[283,14,284,14],[283,15,284,15],[283,16,284,16],[283,17,284,17],[283,18,284,18],[303,20,305,20],[303,21,305,21],[303,22,305,22],[303,29,305,29],[303,30,305,30],[303,31,305,31],[279,26,281,26],[279,27,281,27],[279,28,281,28],[279,29,281,29],[279,30,281,30],[279,31,281,31],[283,26,284,26],[283,27,284,27],[283,28,284,28],[303,26,305,26],[303,23,305,23],[306,0,306,1],[307,2,308,2],[307,3,308,3],[307,4,308,4],[307,5,308,5],[307,6,308,6],[307,7,308,7],[307,8,308,8],[307,9,308,9],[303,19,305,19],[329,0,329,1],[307,26,308,26],[307,27,308,27],[307,28,308,28],[307,29,308,29],[307,30,308,30],[307,10,308,10],[307,11,308,11],[307,12,308,12],[307,13,308,13],[307,14,308,14],[307,15,308,15],[307,21,308,21],[307,22,308,22],[307,23,308,23],[307,24,308,24],[307,25,308,25],[307,16,308,16],[307,17,308,17],[307,18,308,18],[307,19,308,19],[307,20,308,20],[326,2,328,2],[326,3,328,3],[307,31,308,31],[330,7,331,7],[330,8,331,8],[330,9,331,9],[330,10,331,10],[330,11,331,11],[330,2,331,2],[330,3,331,3],[330,4,331,4],[330,5,331,5],[330,6,331,6],[330,17,331,17],[330,18,331,18],[330,19,331,19],[330,20,331,20],[330,21,331,21],[330,12,331,12],[330,13,331,13],[330,14,331,14],[330,15,331,15],[330,16,331,16],[330,27,331,27],[330,28,331,28],[330,29,331,29],[330,30,331,30],[330,31,331,31],[330,22,331,22],[330,23,331,23],[330,24,331,24],[330,25,331,25],[330,26,331,26],[0,5,2,5],[0,2,2,2],[0,3,2,3],[0,4,2,4],[0,6,2,6],[0,7,2,7],[0,8,2,8],[0,9,2,9],[0,10,2,10],[0,11,2,11],[0,12,2,12],[0,13,2,13],[0,14,2,14],[0,15,2,15],[0,16,2,16],[0,17,2,17],[0,18,2,18],[0,19,2,19],[0,29,2,29],[0,30,2,30],[0,31,2,31],[0,20,2,20],[0,21,2,21],[0,22,2,22],[0,23,2,23],[0,24,2,24],[0,25,2,25],[0,26,2,26],[0,27,2,27],[0,28,2,28]]}
[null,{"$f":"TABLAS!$AL$2","v":"BASES PARA LA ELABORACIÓN DE UNA ESTRATEGIA DE REHABILITACIÓN DEL ENTORNO CONSTRUIDO"},{"$f":"IF(OR('ETAPA III.a'!$I$4<COLUMN(C$1)-COLUMN($B$1),COUNTIF(C5:C24,\"X\")+COUNTIF(C30:C92,\"X\")+COUNTIF(C98:C127,\"X\")+COUNTIF(C133:C173,\"X\")+COUNTIF(C179:C203,\"X\")+COUNTIF(C209:C241,\"X\")+COUNTIF(C247:C277,\"X\")+COUNTIF(C284:C302,\"X\")+COUNTIF(C308:C325,\"X\")+COUNTIF(C331:C381,\"X\")>0)=FALSE,\"Error: sin asignar.\",\"\")","v":"Error: sin asignar."},{"$f":"IF(OR('ETAPA III.a'!$I$4<COLUMN(D$1)-COLUMN($B$1),COUNTIF(D5:D24,\"X\")+COUNTIF(D30:D92,\"X\")+COUNTIF(D98:D127,\"X\")+COUNTIF(D133:D173,\"X\")+COUNTIF(D179:D203,\"X\")+COUNTIF(D209:D241,\"X\")+COUNTIF(D247:D277,\"X\")+COUNTIF(D284:D302,\"X\")+COUNTIF(D308:D325,\"X\")+COUNTIF(D331:D381,\"X\")>0)=FALSE,\"Error: sin asignar.\",\"\")","v":"Error: sin asignar."},{"$f":"IF(OR('ETAPA III.a'!$I$4<COLUMN(E$1)-COLUMN($B$1),COUNTIF(E5:E24,\"X\")+COUNTIF(E30:E92,\"X\")+COUNTIF(E98:E127,\"X\")+COUNTIF(E133:E173,\"X\")+COUNTIF(E179:E203,\"X\")+COUNTIF(E209:E241,\"X\")+COUNTIF(E247:E277,\"X\")+COUNTIF(E284:E302,\"X\")+COUNTIF(E308:E325,\"X\")+COUNTIF(E331:E381,\"X\")>0)=FALSE,\"Error: sin asignar.\",\"\")","v":"Error: sin asignar."},{"$f":"IF(OR('ETAPA III.a'!$I$4<COLUMN(F$1)-COLUMN($B$1),COUNTIF(F5:F24,\"X\")+COUNTIF(F30:F92,\"X\")+COUNTIF(F98:F127,\"X\")+COUNTIF(F133:F173,\"X\")+COUNTIF(F179:F203,\"X\")+COUNTIF(F209:F241,\"X\")+COUNTIF(F247:F277,\"X\")+COUNTIF(F284:F302,\"X\")+COUNTIF(F308:F325,\"X\")+COUNTIF(F331:F381,\"X\")>0)=FALSE,\"Error: sin asignar.\",\"\")","v":"Error: sin asignar."},{"$f":"IF(OR('ETAPA III.a'!$I$4<COLUMN(G$1)-COLUMN($B$1),COUNTIF(G5:G24,\"X\")+COUNTIF(G30:G92,\"X\")+COUNTIF(G98:G127,\"X\")+COUNTIF(G133:G173,\"X\")+COUNTIF(G179:G203,\"X\")+COUNTIF(G209:G241,\"X\")+COUNTIF(G247:G277,\"X\")+COUNTIF(G284:G302,\"X\")+COUNTIF(G308:G325,\"X\")+COUNTIF(G331:G381,\"X\")>0)=FALSE,\"Error: sin asignar.\",\"\")","v":"Error: sin asignar."},{"$f":"IF(OR('ETAPA III.a'!$I$4<COLUMN(H$1)-COLUMN($B$1),COUNTIF(H5:H24,\"X\")+COUNTIF(H30:H92,\"X\")+COUNTIF(H98:H127,\"X\")+COUNTIF(H133:H173,\"X\")+COUNTIF(H179:H203,\"X\")+COUNTIF(H209:H241,\"X\")+COUNTIF(H247:H277,\"X\")+COUNTIF(H284:H302,\"X\")+COUNTIF(H308:H325,\"X\")+COUNTIF(H331:H381,\"X\")>0)=FALSE,\"Error: sin asignar.\",\"\")","v":"Error: sin asignar."},{"$f":"IF(OR('ETAPA III.a'!$I$4<COLUMN(I$1)-COLUMN($B$1),COUNTIF(I5:I24,\"X\")+COUNTIF(I30:I92,\"X\")+COUNTIF(I98:I127,\"X\")+COUNTIF(I133:I173,\"X\")+COUNTIF(I179:I203,\"X\")+COUNTIF(I209:I241,\"X\")+COUNTIF(I247:I277,\"X\")+COUNTIF(I284:I302,\"X\")+COUNTIF(I308:I325,\"X\")+COUNTIF(I331:I381,\"X\")>0)=FALSE,\"Error: sin asignar.\",\"\")","v":""},{"$f":"IF(OR('ETAPA III.a'!$I$4<COLUMN(J$1)-COLUMN($B$1),COUNTIF(J5:J24,\"X\")+COUNTIF(J30:J92,\"X\")+COUNTIF(J98:J127,\"X\")+COUNTIF(J133:J173,\"X\")+COUNTIF(J179:J203,\"X\")+COUNTIF(J209:J241,\"X\")+COUNTIF(J247:J277,\"X\")+COUNTIF(J284:J302,\"X\")+COUNTIF(J308:J325,\"X\")+COUNTIF(J331:J381,\"X\")>0)=FALSE,\"Error: sin asignar.\",\"\")","v":""},{"$f":"IF(OR('ETAPA III.a'!$I$4<COLUMN(K$1)-COLUMN($B$1),COUNTIF(K5:K24,\"X\")+COUNTIF(K30:K92,\"X\")+COUNTIF(K98:K127,\"X\")+COUNTIF(K133:K173,\"X\")+COUNTIF(K179:K203,\"X\")+COUNTIF(K209:K241,\"X\")+COUNTIF(K247:K277,\"X\")+COUNTIF(K284:K302,\"X\")+COUNTIF(K308:K325,\"X\")+COUNTIF(K331:K381,\"X\")>0)=FALSE,\"Error: sin asignar.\",\"\")","v":""},{"$f":"IF(OR('ETAPA III.a'!$I$4<COLUMN(L$1)-COLUMN($B$1),COUNTIF(L5:L24,\"X\")+COUNTIF(L30:L92,\"X\")+COUNTIF(L98:L127,\"X\")+COUNTIF(L133:L173,\"X\")+COUNTIF(L179:L203,\"X\")+COUNTIF(L209:L241,\"X\")+COUNTIF(L247:L277,\"X\")+COUNTIF(L284:L302,\"X\")+COUNTIF(L308:L325,\"X\")+COUNTIF(L331:L381,\"X\")>0)=FALSE,\"Error: sin asignar.\",\"\")","v":""},{"$f":"IF(OR('ETAPA III.a'!$I$4<COLUMN(M$1)-COLUMN($B$1),COUNTIF(M5:M24,\"X\")+COUNTIF(M30:M92,\"X\")+COUNTIF(M98:M127,\"X\")+COUNTIF(M133:M173,\"X\")+COUNTIF(M179:M203,\"X\")+COUNTIF(M209:M241,\"X\")+COUNTIF(M247:M277,\"X\")+COUNTIF(M284:M302,\"X\")+COUNTIF(M308:M325,\"X\")+COUNTIF(M331:M381,\"X\")>0)=FALSE,\"Error: sin asignar.\",\"\")","v":""},{"$f":"IF(OR('ETAPA III.a'!$I$4<COLUMN(N$1)-COLUMN($B$1),COUNTIF(N5:N24,\"X\")+COUNTIF(N30:N92,\"X\")+COUNTIF(N98:N127,\"X\")+COUNTIF(N133:N173,\"X\")+COUNTIF(N179:N203,\"X\")+COUNTIF(N209:N241,\"X\")+COUNTIF(N247:N277,\"X\")+COUNTIF(N284:N302,\"X\")+COUNTIF(N308:N325,\"X\")+COUNTIF(N331:N381,\"X\")>0)=FALSE,\"Error: sin asignar.\",\"\")","v":""},{"$f":"IF(OR('ETAPA III.a'!$I$4<COLUMN(O$1)-COLUMN($B$1),COUNTIF(O5:O24,\"X\")+COUNTIF(O30:O92,\"X\")+COUNTIF(O98:O127,\"X\")+COUNTIF(O133:O173,\"X\")+COUNTIF(O179:O203,\"X\")+COUNTIF(O209:O241,\"X\")+COUNTIF(O247:O277,\"X\")+COUNTIF(O284:O302,\"X\")+COUNTIF(O308:O325,\"X\")+COUNTIF(O331:O381,\"X\")>0)=FALSE,\"Error: sin asignar.\",\"\")","v":""},{"$f":"IF(OR('ETAPA III.a'!$I$4<COLUMN(P$1)-COLUMN($B$1),COUNTIF(P5:P24,\"X\")+COUNTIF(P30:P92,\"X\")+COUNTIF(P98:P127,\"X\")+COUNTIF(P133:P173,\"X\")+COUNTIF(P179:P203,\"X\")+COUNTIF(P209:P241,\"X\")+COUNTIF(P247:P277,\"X\")+COUNTIF(P284:P302,\"X\")+COUNTIF(P308:P325,\"X\")+COUNTIF(P331:P381,\"X\")>0)=FALSE,\"Error: sin asignar.\",\"\")","v":""},{"$f":"IF(OR('ETAPA III.a'!$I$4<COLUMN(Q$1)-COLUMN($B$1),COUNTIF(Q5:Q24,\"X\")+COUNTIF(Q30:Q92,\"X\")+COUNTIF(Q98:Q127,\"X\")+COUNTIF(Q133:Q173,\"X\")+COUNTIF(Q179:Q203,\"X\")+COUNTIF(Q209:Q241,\"X\")+COUNTIF(Q247:Q277,\"X\")+COUNTIF(Q284:Q302,\"X\")+COUNTIF(Q308:Q325,\"X\")+COUNTIF(Q331:Q381,\"X\")>0)=FALSE,\"Error: sin asignar.\",\"\")","v":""},{"$f":"IF(OR('ETAPA III.a'!$I$4<COLUMN(R$1)-COLUMN($B$1),COUNTIF(R5:R24,\"X\")+COUNTIF(R30:R92,\"X\")+COUNTIF(R98:R127,\"X\")+COUNTIF(R133:R173,\"X\")+COUNTIF(R179:R203,\"X\")+COUNTIF(R209:R241,\"X\")+COUNTIF(R247:R277,\"X\")+COUNTIF(R284:R302,\"X\")+COUNTIF(R308:R325,\"X\")+COUNTIF(R331:R381,\"X\")>0)=FALSE,\"Error: sin asignar.\",\"\")","v":""},{"$f":"IF(OR('ETAPA III.a'!$I$4<COLUMN(S$1)-COLUMN($B$1),COUNTIF(S5:S24,\"X\")+COUNTIF(S30:S92,\"X\")+COUNTIF(S98:S127,\"X\")+COUNTIF(S133:S173,\"X\")+COUNTIF(S179:S203,\"X\")+COUNTIF(S209:S241,\"X\")+COUNTIF(S247:S277,\"X\")+COUNTIF(S284:S302,\"X\")+COUNTIF(S308:S325,\"X\")+COUNTIF(S331:S381,\"X\")>0)=FALSE,\"Error: sin asignar.\",\"\")","v":""},{"$f":"IF(OR('ETAPA III.a'!$I$4<COLUMN(T$1)-COLUMN($B$1),COUNTIF(T5:T24,\"X\")+COUNTIF(T30:T92,\"X\")+COUNTIF(T98:T127,\"X\")+COUNTIF(T133:T173,\"X\")+COUNTIF(T179:T203,\"X\")+COUNTIF(T209:T241,\"X\")+COUNTIF(T247:T277,\"X\")+COUNTIF(T284:T302,\"X\")+COUNTIF(T308:T325,\"X\")+COUNTIF(T331:T381,\"X\")>0)=FALSE,\"Error: sin asignar.\",\"\")","v":""},{"$f":"IF(OR('ETAPA III.a'!$I$4<COLUMN(U$1)-COLUMN($B$1),COUNTIF(U5:U24,\"X\")+COUNTIF(U30:U92,\"X\")+COUNTIF(U98:U127,\"X\")+COUNTIF(U133:U173,\"X\")+COUNTIF(U179:U203,\"X\")+COUNTIF(U209:U241,\"X\")+COUNTIF(U247:U277,\"X\")+COUNTIF(U284:U302,\"X\")+COUNTIF(U308:U325,\"X\")+COUNTIF(U331:U381,\"X\")>0)=FALSE,\"Error: sin asignar.\",\"\")","v":""},{"$f":"IF(OR('ETAPA III.a'!$I$4<COLUMN(V$1)-COLUMN($B$1),COUNTIF(V5:V24,\"X\")+COUNTIF(V30:V92,\"X\")+COUNTIF(V98:V127,\"X\")+COUNTIF(V133:V173,\"X\")+COUNTIF(V179:V203,\"X\")+COUNTIF(V209:V241,\"X\")+COUNTIF(V247:V277,\"X\")+COUNTIF(V284:V302,\"X\")+COUNTIF(V308:V325,\"X\")+COUNTIF(V331:V381,\"X\")>0)=FALSE,\"Error: sin asignar.\",\"\")","v":""},{"$f":"IF(OR('ETAPA III.a'!$I$4<COLUMN(W$1)-COLUMN($B$1),COUNTIF(W5:W24,\"X\")+COUNTIF(W30:W92,\"X\")+COUNTIF(W98:W127,\"X\")+COUNTIF(W133:W173,\"X\")+COUNTIF(W179:W203,\"X\")+COUNTIF(W209:W241,\"X\")+COUNTIF(W247:W277,\"X\")+COUNTIF(W284:W302,\"X\")+COUNTIF(W308:W325,\"X\")+COUNTIF(W331:W381,\"X\")>0)=FALSE,\"Error: sin asignar.\",\"\")","v":""},{"$f":"IF(OR('ETAPA III.a'!$I$4<COLUMN(X$1)-COLUMN($B$1),COUNTIF(X5:X24,\"X\")+COUNTIF(X30:X92,\"X\")+COUNTIF(X98:X127,\"X\")+COUNTIF(X133:X173,\"X\")+COUNTIF(X179:X203,\"X\")+COUNTIF(X209:X241,\"X\")+COUNTIF(X247:X277,\"X\")+COUNTIF(X284:X302,\"X\")+COUNTIF(X308:X325,\"X\")+COUNTIF(X331:X381,\"X\")>0)=FALSE,\"Error: sin asignar.\",\"\")","v":""},{"$f":"IF(OR('ETAPA III.a'!$I$4<COLUMN(Y$1)-COLUMN($B$1),COUNTIF(Y5:Y24,\"X\")+COUNTIF(Y30:Y92,\"X\")+COUNTIF(Y98:Y127,\"X\")+COUNTIF(Y133:Y173,\"X\")+COUNTIF(Y179:Y203,\"X\")+COUNTIF(Y209:Y241,\"X\")+COUNTIF(Y247:Y277,\"X\")+COUNTIF(Y284:Y302,\"X\")+COUNTIF(Y308:Y325,\"X\")+COUNTIF(Y331:Y381,\"X\")>0)=FALSE,\"Error: sin asignar.\",\"\")","v":""},{"$f":"IF(OR('ETAPA III.a'!$I$4<COLUMN(Z$1)-COLUMN($B$1),COUNTIF(Z5:Z24,\"X\")+COUNTIF(Z30:Z92,\"X\")+COUNTIF(Z98:Z127,\"X\")+COUNTIF(Z133:Z173,\"X\")+COUNTIF(Z179:Z203,\"X\")+COUNTIF(Z209:Z241,\"X\")+COUNTIF(Z247:Z277,\"X\")+COUNTIF(Z284:Z302,\"X\")+COUNTIF(Z308:Z325,\"X\")+COUNTIF(Z331:Z381,\"X\")>0)=FALSE,\"Error: sin asignar.\",\"\")","v":""},{"$f":"IF(OR('ETAPA III.a'!$I$4<COLUMN(AA$1)-COLUMN($B$1),COUNTIF(AA5:AA24,\"X\")+COUNTIF(AA30:AA92,\"X\")+COUNTIF(AA98:AA127,\"X\")+COUNTIF(AA133:AA173,\"X\")+COUNTIF(AA179:AA203,\"X\")+COUNTIF(AA209:AA241,\"X\")+COUNTIF(AA247:AA277,\"X\")+COUNTIF(AA284:AA302,\"X\")+COUNTIF(AA308:AA325,\"X\")+COUNTIF(AA331:AA381,\"X\")>0)=FALSE,\"Error: sin asignar.\",\"\")","v":""},{"$f":"IF(OR('ETAPA III.a'!$I$4<COLUMN(AB$1)-COLUMN($B$1),COUNTIF(AB5:AB24,\"X\")+COUNTIF(AB30:AB92,\"X\")+COUNTIF(AB98:AB127,\"X\")+COUNTIF(AB133:AB173,\"X\")+COUNTIF(AB179:AB203,\"X\")+COUNTIF(AB209:AB241,\"X\")+COUNTIF(AB247:AB277,\"X\")+COUNTIF(AB284:AB302,\"X\")+COUNTIF(AB308:AB325,\"X\")+COUNTIF(AB331:AB381,\"X\")>0)=FALSE,\"Error: sin asignar.\",\"\")","v":""},{"$f":"IF(OR('ETAPA III.a'!$I$4<COLUMN(AC$1)-COLUMN($B$1),COUNTIF(AC5:AC24,\"X\")+COUNTIF(AC30:AC92,\"X\")+COUNTIF(AC98:AC127,\"X\")+COUNTIF(AC133:AC173,\"X\")+COUNTIF(AC179:AC203,\"X\")+COUNTIF(AC209:AC241,\"X\")+COUNTIF(AC247:AC277,\"X\")+COUNTIF(AC284:AC302,\"X\")+COUNTIF(AC308:AC325,\"X\")+COUNTIF(AC331:AC381,\"X\")>0)=FALSE,\"Error: sin asignar.\",\"\")","v":""},{"$f":"IF(OR('ETAPA III.a'!$I$4<COLUMN(AD$1)-COLUMN($B$1),COUNTIF(AD5:AD24,\"X\")+COUNTIF(AD30:AD92,\"X\")+COUNTIF(AD98:AD127,\"X\")+COUNTIF(AD133:AD173,\"X\")+COUNTIF(AD179:AD203,\"X\")+COUNTIF(AD209:AD241,\"X\")+COUNTIF(AD247:AD277,\"X\")+COUNTIF(AD284:AD302,\"X\")+COUNTIF(AD308:AD325,\"X\")+COUNTIF(AD331:AD381,\"X\")>0)=FALSE,\"Error: sin asignar.\",\"\")","v":""},{"$f":"IF(OR('ETAPA III.a'!$I$4<COLUMN(AE$1)-COLUMN($B$1),COUNTIF(AE5:AE24,\"X\")+COUNTIF(AE30:AE92,\"X\")+COUNTIF(AE98:AE127,\"X\")+COUNTIF(AE133:AE173,\"X\")+COUNTIF(AE179:AE203,\"X\")+COUNTIF(AE209:AE241,\"X\")+COUNTIF(AE247:AE277,\"X\")+COUNTIF(AE284:AE302,\"X\")+COUNTIF(AE308:AE325,\"X\")+COUNTIF(AE331:AE381,\"X\")>0)=FALSE,\"Error: sin asignar.\",\"\")","v":""},{"$f":"IF(OR('ETAPA III.a'!$I$4<COLUMN(AF$1)-COLUMN($B$1),COUNTIF(AF5:AF24,\"X\")+COUNTIF(AF30:AF92,\"X\")+COUNTIF(AF98:AF127,\"X\")+COUNTIF(AF133:AF173,\"X\")+COUNTIF(AF179:AF203,\"X\")+COUNTIF(AF209:AF241,\"X\")+COUNTIF(AF247:AF277,\"X\")+COUNTIF(AF284:AF302,\"X\")+COUNTIF(AF308:AF325,\"X\")+COUNTIF(AF331:AF381,\"X\")>0)=FALSE,\"Error: sin asignar.\",\"\")","v":""}]
[null,{"$f":"TABLAS!$AL$6","v":"ETAPA III: PROGRAMA DE ACTUACIONES"}]
[null,{"$f":"TABLAS!$AL$4","v":""}]
["LÍNEAS DE ACTUACIÓN",null,"ACCIONES"]
[1,"ORDENAR EL TERRTORIO Y HACER UN USO RACIONAL DEL SUELO, CONSERVARLO Y PROTEGERLO","A.1","A.2","A.3","A.4","A.5","A.6","A.7","A.8","A.9","A.10","A.11","A.12","A.13","A.14","A.15","A.16","A.17","A.18","A.19","A.20","A.21","A.22","A.23","A.24","A.25","A.26","A.27","A.28","A.29","A.30"]
["1.1","Ordenar el suelo de manera compatible con su entorno territorial."]
["1.1.1","Disponer de una estrategia o plan de ordenación del territorio que establezca las bases del modelo territorial. Pueden ser estrategias regionales, subregionales e incluso sectoriales, pero deben tener en común la utilización racional del territorio. "]
["1.1.2","Introducir medidas para vincular la ordenación territorial con la planificación económica, cultural y de los recursos naturales, con el objetivo de limitar la despoblación y contribuir a la conservación de la naturaleza, la protección de los usos rurales tradicionales y prestar una especial atención a los pequeños núcleos de población. La despoblación es fundamentalmente un problema territorial y de ausencia de visión estratégica y de desarrollo supralocal."]
["1.1.3","Diseñar la ciudad de conformidad con el modelo territorial y de manera coordinada con los núcleos adyacentes, teniendo en cuenta sus características propias de clima, humedad, territorio y paisaje. "]
["1.1.4","Reducir el consumo de suelo virgen adecuándolo a las dinámicas de la población y a las nuevas actividades económicas, fomentando la productividad del suelo ya transformado. Esto requiere la realización de Memorias realistas que no sólo respondan al trámite formal de incorporación de dicho   documento al resto de la documentación del correspondiente Plan urbanístico o territorial."]
["1.1.5","Impulsar la máxima interconexión entre los ámbitos rural y urbano, fomentando su interdependencia mediante políticas económicas, medioambientales, sociales y de gobernanza, con medidas que favorezcan las actividades forestales y agrícolas urbanas y periurbanas ordenadas, así como las ganaderas, y las políticas de desarrollo rural sostenible."]
["1.1.6","Potenciar la inclusión del patrimonio natural en los catálogos municipales que formen parte de la documentación del planeamiento. "]
["1.1.7","Poner en marcha mecanismos de coordinación y colaboración que se basen en la utilización sostenible del territorio, en las regiones o ciudades con relaciones de vecindad transfronteriza o interregional."]
["1.2","Conservar y mejorar el patrimonio natural y cultural y proteger el paisaje.","A1","A2","A3","A4","A5","A6","A7","A8","A9","A10","A11","A12","A13","A14","A15","A16","A17","A18","A19","A20","A21","A22","A23","A24","A25","A26","A27","A28","A29","A30"]
["1.2.1","Elaborar estrategias para mejorar, conservar y poner en valor el patrimonio cultural (tanto en sus aspectos tangibles, como intangibles –formas de vida, tradiciones, etc.-) y el paisaje urbano y rural, con el fin de desarrollar todo su potencial y garantizar un nivel adecuado de conservación y mantenimiento."]
["1.2.2","Adoptar medidas de conservación, mejora y protección de la naturaleza y del patrimonio natural: flora, fauna, paisaje y ecosistemas existentes. A tales efectos se propone la adopción de medidas dirigidas a reducir el empleo de herbicidas químicos, la mejora de los hábitats de los polinizadores en las áreas urbanas y periurbanas, etc., así como aplicar metodologías y programas de seguimiento de la biodiversidad urbana. "]
["1.2.3","Proteger el medio rural de acuerdo con su carácter, especialmente el suelo rural fronterizo, de borde o colindante con el suelo urbano."]
["1.2.4","Realizar un adecuado aprovechamiento de los montes desde el punto de vista de la biomasa forestal con fines energéticos, como parte de una estrategia para el impulso del desarrollo rural, la conservación de los usos tradicionales que favorezcan la conservación de los espacios naturales y la prevención de los incendios."]
["1.2.5","Poner en marcha campañas de difusión del patrimonio cultural y natural, para conseguir una auténtica cultura de pertenencia basada en el conocimiento, que se sume a su utilización racional como recurso económico y turístico. "]
["1.3","Mejorar las infraestructuras verdes y azules y vincularlas con el contexto natural.","A1","A2","A3","A4","A5","A6","A7","A8","A9","A10","A11","A12","A13","A14","A15","A16","A17","A18","A19","A20","A21","A22","A23","A24","A25","A26","A27","A28","A29","A30"]
["1.3.1","Incorporar a la planificación y a la gestión urbanística el concepto de infraestructuras verdes urbanas, como soluciones multifuncionales basadas en la naturaleza, que permiten atender a los problemas urbanos. No sólo contribuyen a mejorar la biodiversidad, sino que luchan contra el cambio climático, tanto en el ámbito de la reducción de las emisiones GEIs, como en la adaptación local. Por último, contribuyen al ocio y al disfrute ciudadano. Este tipo de infraestructuras son por tanto, claves para la comprensión y gestión del metabolismo urbano."]
["1.3.2","Organizar y diseñar las redes de infraestructuras verdes y azules teniendo en cuenta criterios de conectividad ecológica y de las características geomorfológicas del territorio, con el objetivo de optimizar la prestación de servicios eco-sistémicos a los ciudadanos. Ello implica, también, delimitar e identificar los elementos que constituyen estas infraestructuras y establecer medidas para su restauración, conservación y gestión, a escala regional, local y de barrio. "]
["1.3.3","Asignar los usos del suelo en coherencia con las características de la base territorial preexistente."]
["1.3.4","Aprovechar las vías pecuarias e incorporarlas con criterios de conectividad ecológica y como fórmula para combatir la fragmentación territorial."]
[]
[null,{"$f":"TABLAS!$AL$2","v":"BASES PARA LA ELABORACIÓN DE UNA ESTRATEGIA DE REHABILITACIÓN DEL ENTORNO CONSTRUIDO"},{"$f":"IF(C$1=\"\",\"\",C$1)","v":"Error: sin asignar."},{"$f":"IF(D$1=\"\",\"\",D$1)","v":"Error: sin asignar."},"Error: sin asignar.","Error: sin asignar.","Error: sin asignar.","Error: sin asignar.","","","","","","","","","","","","","","","","","","","","","","","",""]
[null,{"$f":"IF($B$2=\"\",\"\",$B$2)","v":"ETAPA III: PROGRAMA DE ACTUACIONES"}]
[null,{"$f":"TABLAS!$AL$4","v":""}]
["LÍNEAS DE ACTUACIÓN",null,"ACCIONES"]
[2,"EVITAR LA DISPERSIÓN URBANA Y REVITALIZAR LA CIUDAD EXISTENTE","A.1","A.2","A.3","A.4","A.5","A.6","A.7","A.8","A.9","A.10","A.11","A.12","A.13","A.14","A.15","A.16","A.17","A.18","A.19","A.20","A.21","A.22","A.23","A.24","A.25","A.26","A.27","A.28","A.29","A.30"]
["2.1","Definir un modelo urbano que fomente la compacidad, el equilibrio urbano y la dotación de servicos básicos."]
["2.1.1","Adoptar medidas a través del planeamiento territorial y urbanístico que aseguren un resultado equilibrado, favoreciendo los procesos de ocupación y de transformación del suelo, cuando correspondan, con una densidad urbana adecuada. "]
["2.1.2","Evaluar el coste de la expansión urbana descontrolada, incluyendo todas sus consecuencias y externalidades negativas."]
["2.1.3","Incrementar la compacidad de los tejidos urbanos excesivamente laxos, propios de las urbanizaciones de baja densidad, propiciando, según los casos, incrementos de edificabilidad, de densidad o el reajuste de dotaciones sobredimensionadas. "]
["2.1.4","Diseñar un sistema de dotaciones y equipamientos locales adecuado y equilibrado, cuantitativa y cualitativamente, y teniendo en cuenta el criterio de proximidad para su localización, con especial atención a las zonas verdes y a los espacios libres de convivencia. Estudiar la posibilidad de combinar usos dotacionales diferentes en un solo equipamiento en tiempos diferentes, favoreciendo la multifuncionalidad. "]
["2.1.5","Implementar medidas que permitan satisfacer de forma autónoma a nivel de barrio y en la mayor medida posible, las necesidades cotidianas de la población, adecuando la oferta de servicios y equipamientos."]
["2.1.6","No generalizar los equipamientos y su absoluta identidad en todos los barrios. Es preciso graduar los realmente necesarios en cada uno de ellos para evitar costes económicos y medioambientales insostenibles."]
["2.1.7","Asegurar la prestación de los servicios públicos que favorezcan la conciliación familiar a la vez que contribuyen a la igualdad de trato y a la igualdad efectiva de mujeres y hombres, como residencias de mayores, centros de día, guarderías, o campamentos municipales. Todo ello en el marco de las respectivas competencias."]
["2.1.8","Reurbanizar zonas industriales abandonadas y reedificar y reutilizar terrenos y edificios vacantes e infrautilizados, incluida la identificación, con mapas, de los inmuebles infrautilizados."]
["2.1.9","Potenciar el uso del espacio público para la generación de energías renovables, estableciendo recomendaciones, o incluso obligaciones en función de la superficie, para conseguir dicho objetivo (ejemplo: cubrición con placas fotovoltaicas de los espacios destinados a aparcamientos de vehículos en superficie en suelo urbano)."]
["2.1.10","Evaluar, medir y gestionar las ocupaciones ilegales de suelos y edificios."]
["2.1.11","Poner en marcha mecanismos de coordinación y colaboración interadministrativa para mejorar la prestación de servicios básicos en los pequeños núcleos de población, sobre todo en aquéllos que, de acuerdo con la planificación territorial, responden a un modelo de equilibrio territorial reconocido (Consorcios, Mancomunidades, etc.)"]
["2.2","Garantizar la complejidad funcional y diversidad de usos. ","A1","A2","A3","A4","A5","A6","A7","A8","A9","A10","A11","A12","A13","A14","A15","A16","A17","A18","A19","A20","A21","A22","A23","A24","A25","A26","A27","A28","A29","A30"]
["2.2.1","Asegurar con el planeamiento urbanístico una ocupación y uso del suelo eficiente combinando los usos compatibles, principalmente a escala de barrio."]
["2.2.2","Conectar los tejidos urbanos mediante corredores continuos de actividad y buscar la mezcla tipológica, funcional y social en la ciudad consolidada. "]
["2.2.3","Incentivar las actividades que favorecen la diversidad de usos y reservar espacio suficiente para actividades económicas y productivas. "]
["2.2.4","Evitar la terciarización y la gentrificación de determinadas áreas de la ciudad equilibrando los usos residenciales con los usos terciarios."]
["2.2.5","Favorecer la mezcla de usos en los edificios, flexibilizando los planes urbanísticos para que pueda responder a una demanda real cambiante. Es preciso tener en cuenta que las decisiones en la planificación territorial y urbana cambian los entornos, afectan a los lugares en los que se vive y se trabaja, a la forma de desplazarse, a qué se dedica el tiempo de ocio, siendo factores que determinan la salud de las personas, por lo que es necesario su análisis y seguimiento, la consideración de la equidad en los procesos de planeamiento, la participación comunitaria y el desarrollo de instrumentos que faciliten su visibilización desde las etapas más tempranas de la planificación. "]
["2.3","Mejorar la calidad y la accesibilidad universal de los espacios públicos. ","A1","A2","A3","A4","A5","A6","A7","A8","A9","A10","A11","A12","A13","A14","A15","A16","A17","A18","A19","A20","A21","A22","A23","A24","A25","A26","A27","A28","A29","A30"]
["2.3.1","Impulsar el espacio público como eje vertebrador de la ciudad con entornos propicios para garantizar una vida saludable a todos los sectores de la población.  "]
["2.3.2","Fomentar la diversidad, la calidad y la versatilidad de los espacios públicos, dotarlos de un mobiliario adecuado y polivalente, convenientemente revisado y mejorar su estética, conservación y belleza. Atender al paisaje urbano."]
["2.3.3","Fomentar la cultura, el intercambio, la convivencia y el ocio urbanos, convirtiendo las calles en “plazas”, para lograr que el espacio público sea una seña de identidad. "]
["2.3.4","Fomentar las medidas de intervención en los espacios públicos y edificios que reduzcan y/o eliminen los impactos negativos sobre la salud de los ciudadanos."]
["2.3.5","Activar los espacios de convivencia como fórmula para mejorar la salud psíquica de los ciudadanos y romper burbujas de soledad y de aislamiento, propiciando la diversidad de usos, el intercambio cultural y el sentido de pertenencia al lugar. "]
["2.3.6","Tomar en consideración la inclusión de los animales de compañía en la vida urbana, reconociendo su contribución a la salud física y mental de muchas personas."]
["2.3.7","Eliminar barreras arquitectónicas, persiguiendo la mayor autonomía de las personas con discapacidad o con movilidad reducida, mejorando la accesibilidad universal a espacios y equipamientos públicos, vivienda y servicios básicos. "]
["2.3.8","Asegurar el mayor confort posible del espacio público a través del control del ruido, de la contaminación del aire y de la lumínica y de las condiciones térmicas, haciéndolo atractivo y saludable."]
["2.3.9","Liberar espacio público ocupado por el automóvil privado para convertirlo en espacio público de uso múltiple, favoreciendo los usos peatonales y el comercio local."]
["2.3.10","Generar espacios públicos seguros, lo que en gran medida se consigue con su ocupación constante. De ahí que garantizar una densidad adecuada del tejido urbano y actividades que contribuyan a conseguir entornos transitados sea un buen instrumento para ello. "]
["2.3.11","Avanzar en la “geoprevención”, es decir, en prevenir el crimen a través del diseño ambiental, asegurando una adecuada relación entre el medio urbano y la seguridad pública. Las distintas vulnerabilidades procedentes de situaciones socioculturales, económicas o políticas pueden minimizarse con herramientas aún por desarrollar como el control natural de los accesos, la vigilancia natural, el refuerzo del territorio, el mantenimiento de los espacios públicos y la participación comunitaria."]
["2.3.12","Garantizar no sólo la seguridad contra la delincuencia, sino también la seguridad frente a los accidentes, con medidas preventivas como el diseño de calles con pendientes adecuadas, identificación de zonas inaccesibles, evaluación de la jerarquización viaria, atención a los cruces e intersecciones de los peatones con los vehículos, cuidado con los acabados superficiales urbanos, etc."]
["2.4","Mejorar el medioambiente urbano y reducir la contaminación.","A1","A2","A3","A4","A5","A6","A7","A8","A9","A10","A11","A12","A13","A14","A15","A16","A17","A18","A19","A20","A21","A22","A23","A24","A25","A26","A27","A28","A29","A30"]
["2.4.1","Garantizar un hábitat saludable y seguro que permita un desarrollo cultural, social y económico pleno. "]
["2.4.2","Fomentar la creación o mejora de zonas e infraestructuras verdes, tanto a escala de barrio como de ciudad, con el objeto de favorecer la vinculación de la ciudad con la naturaleza y favorecer la continuidad física del entorno."]
["2.4.3","Definir una superficie mínima de las zonas verdes con el criterio de que un mayor porcentaje de ciudadanos tenga acceso a una zona verde de proximidad que esté adecuadamente dimensionada en función de las necesidades existentes, con especial atención al paisaje y a su valor como herramienta de calidad del entorno urbano."]
["2.4.4","Fomentar actuaciones para reducir la contaminación acústica, lumínica y visual y minimizar su impacto en la salud y en la calidad de vida."]
["2.4.5","Poner en marcha medidas de reconversión de suelos urbanos degradados en zonas verdes y parques para contribuir a la mejora del medio ambiente urbano y a la reducción de la contaminación, mediante el uso de técnicas de Restauración Ecológica. "]
["2.4.6","Descontaminar suelos de usos industriales en desuso y proceder a su recuperación ambiental con carácter previo a su nueva utilización como suelo urbano. "]
["2.4.7","Establecer, en los instrumentos de planeamiento territorial y urbanístico, distancias suficientes entre las viviendas y todo tipo de actividades contaminantes de la atmósfera, como los polígonos industriales, las autopistas y las autovías."]
["2.5","Impulsar la regeneración urbana.","A1","A2","A3","A4","A5","A6","A7","A8","A9","A10","A11","A12","A13","A14","A15","A16","A17","A18","A19","A20","A21","A22","A23","A24","A25","A26","A27","A28","A29","A30"]
["2.5.1","Garantizar la regeneración urbana integrada, de forma que las operaciones físico-urbanísticas estén vinculadas con programas sociales, educativos y laborales, actuando de forma prioritaria en los barrios que mayor vulnerabilidad urbana presenten."]
["2.5.2","Fomentar e impulsar la rehabilitación edificatoria y la regeneración urbana para lograr un adecuado equilibrio entre esta actividad y la de generación de nueva ciudad. En especial, favorecer las propuestas de regeneración urbana que provengan del ámbito del cooperativismo."]
["2.5.3","Promover la regeneración y la renovación urbanas a gran escala y vincularlas con herramientas de lucha contra el cambio climático y con la existencia de un parque de viviendas accesibles y asequibles a través de la rehabilitación. "]
["2.5.4","Identificar posibles incrementos de valor en la edificación que puedan movilizar rehabilitaciones integrales, tanto públicas, como privadas. Entre ellos el aumento de la edificabilidad, el aumento del número de viviendas, los cambios de uso y la densificación de zonas periurbanas de baja densidad, así como definir herramientas que puedan condicionar estas técnicas a la creación de un parque de vivienda de calidad, accesible y asequible."]
["2.5.5","Definir métodos fiables y consensuados para evaluar las actuaciones de regeneración y renovación urbanas a gran escala que permitan mejorar los procedimientos de activación de estas intervenciones."]
["2.5.6","Poner en marcha mecanismos para identificar sinergias entre diferentes tipos de intervención en la ciudad consolidada desde un enfoque integral y a largo plazo."]
["2.5.7","Favorecer desde las Administraciones Públicas la financiación y la viabilidad de las actuaciones de rehabilitación, regeneración y renovación urbanas, incluso fomentando la colaboración del sector privado. "]
["2.5.8","Adoptar medidas para evitar que la renovación urbana lleve aparejados efectos colaterales de gentrificación, que impliquen cambios inadecuados en la morfología urbana y pérdida de la población residente."]
["2.5.9","Aprovechar el patrimonio cultural para realizar operaciones de regeneración urbana, porque es una verdadera oportunidad para la misma."]
["2.5.10","Fomentar la autopromoción en los cascos urbanos de los pueblos y ciudades más pequeños, para contribuir a su preservación y al objetivo de fijar población."]
["2.5.11","Arbitrar fórmulas de división y segregación de viviendas grandes en varias viviendas para adaptarlas a configuraciones que respondan a las demandas actuales, favorecer el alquiler y evitar su degradación por falta de mantenimiento."]
["2.5.12","Utilizar metodologías de participación como talleres o foros, que permitan la implicación, desde el inicio y de forma continuada, del tejido social a lo largo de estos procesos de transformación urbana."]
["2.6","Mejorar la calidad y sostenibilidad de los edificios.","A1","A2","A3","A4","A5","A6","A7","A8","A9","A10","A11","A12","A13","A14","A15","A16","A17","A18","A19","A20","A21","A22","A23","A24","A25","A26","A27","A28","A29","A30"]
["2.6.1","Propiciar una visión integral del entorno construido, y no sólo de la edificación."]
["2.6.2","Mejorar el estado de conservación, seguridad, mantenimiento de los edificios y la habitabilidad de las viviendas."]
["2.6.3","Avanzar hacia la accesibilidad universal en edificios y viviendas."]
["2.6.4","Impulsar la mejora de la eficiencia energética del parque edificatorio existente con todas las medidas disponibles y posibles: fiscales, de agilización y simplificación de los trámites administrativos y mediante la puesta en marcha de campañas pedagógicas.   "]
["2.6.5","Promover las Inspecciones Técnicas de Edificios o los Informes de Evaluación de los Edificios para fomentar la puesta en marcha de medidas preventivas que impulsen el mantenimiento preventivo y no sólo corrector o paliativo en los edificios."]
["2.6.6","Utilizar mecanismos que permitan lograr sinergias entre los diferentes tipos de intervención en los edificios: mantenimiento, accesibilidad, eficiencia energética, etc. Se trata de potenciar la actuación integral sobre ellos."]
["2.6.7","Emplear técnicas constructivas eficientes que garanticen el uso de materiales adecuados para los edificios y viviendas y que faciliten la reutilización. Se trataría de “construir para durar”. "]
["2.6.8","Impulsar el uso y la actualización del Libro del Edificio durante la vida útil del mismo. Fomentar el Libro del Edificio “existente” en el que consten las reparaciones y rehabilitaciones realizadas a lo largo de su vida útil."]
["2.6.9","Impulsar medidas para garantizar la participación de técnicos y empresas de rehabilitación y reforma, que cumplan con sus obligaciones profesionales, para garantizar un correcto diseño y ejecución, lo que redunda en la calidad, la seguridad y la tranquilidad.  Un ejemplo podría ser la solicitud de información sobre la empresa (REA, seguro de responsabilidad civil, al día en Hacienda y Seguridad Social, es decir, datos objetivos y obligatorios) a la hora de otorgar las licencias o posibles subvenciones públicas."]
[]
[null,{"$f":"TABLAS!$AL$2","v":"BASES PARA LA ELABORACIÓN DE UNA ESTRATEGIA DE REHABILITACIÓN DEL ENTORNO CONSTRUIDO"},{"$f":"IF(C$1=\"\",\"\",C$1)","v":"Error: sin asignar."},{"$f":"IF(D$1=\"\",\"\",D$1)","v":"Error: sin asignar."},"Error: sin asignar.","Error: sin asignar.","Error: sin asignar.","Error: sin asignar.","","","","","","","","","","","","","","","","","","","","","","","",""]
[null,{"$f":"IF($B$2=\"\",\"\",$B$2)","v":"ETAPA III: PROGRAMA DE ACTUACIONES"}]
[null,{"$f":"TABLAS!$AL$4","v":""}]
["LÍNEAS DE ACTUACIÓN",null,"ACCIONES"]
[3,"PREVENIR Y REDUCIR LOS IMPACTOS DEL CAMBIO CLIMÁTICO Y MEJORAR LA RESILIENCIA","A.1","A.2","A.3","A.4","A.5","A.6","A.7","A.8","A.9","A.10","A.11","A.12","A.13","A.14","A.15","A.16","A.17","A.18","A.19","A.20","A.21","A.22","A.23","A.24","A.25","A.26","A.27","A.28","A.29","A.30"]
["3.1","Adaptar el modelo territorial y urbano a los efectos del cambio climático y avanzar en su prevención."]
["3.1.1","Desarrollar un planeamiento sectorial, territorial y urbanístico que responda a la prevención frente a los riesgos naturales y que garantice la aplicación de normas específicas al respecto, tanto en las infraestructuras, como en las instalaciones y en las construcciones y edificaciones."]
["3.1.2","Incorporar mapas de riesgos naturales al planeamiento, de manera que se eviten actuaciones de transformación urbana que sean susceptibles de verse afectadas por inundaciones, lluvias torrenciales, elevación del nivel del mar, insuficiencia hídrica, riesgo de deslizamiento de tierras, etc."]
["3.1.3","Incluir nuevas previsiones en los instrumentos de planeamiento, relacionadas con la adaptación y mitigación de los efectos del cambio climático: subida del mar, pérdida de suelo fértil, lluvias torrenciales, incendios forestales, aumento de las temperaturas o grandes periodos de sequía."]
["3.1.4","Poner en marcha planes de emergencia frente al cambio climático y, más ampliamente, planes de acción por el clima y la energía sostenible."]
["3.1.5","Fomentar las actuaciones de prevención y adaptación en aquellos suelos urbanizados susceptibles de ser afectados por riesgos naturales."]
["3.1.6","Incorporar a la planificación y a la gestión del territorio y del urbanismo el concepto de infraestructuras verdes urbanas y azules, como soluciones multifuncionales basadas en la naturaleza, que resuelven problemas urbanos que van  más allá de sus funcionalidades para la mejora de la biodiversidad como son: el tratamiento de zonas inundables, la reducción de islas de calor, la lucha contra el cambio climático, la reducción de emisiones GEIs y, por supuesto, para ir adaptando localmente el ocio y el disfrute ciudadano en dichos espacios. Sería oportuno elaborar regulaciones que guíen la forma de introducirlas en las políticas urbanas, los mecanismos y marcos de financiación y determinados estándares e indicadores, así como las campañas específicas de sensibilización, especialmente sobre sus beneficios."]
["3.1.7","Reducir la isla de calor de las actuales ciudades, actuando sobre los factores que influyen en el comportamiento climático del entorno urbano. Para ello podría ser útil promover la permeabilización y vegetación de los espacios públicos, incorporar en las herramientas de planificación y gestión urbana el mapeado del clima urbano."]
["3.1.8","Aprobar y poner en marcha planes y programas de reconversión industrial de las industrias contaminantes para mejorar el comportamiento ambiental de establecimientos industriales “maduros” y para disminuir los efectos adversos de sus actividades para las personas y el entorno."]
["3.1.9","Trabajar mediante redes de ciudades (Red del Clima, Red Española de Sostenibilidad Local, Redes provinciales de municipios para la sostenibilidad, etc.) impulsando acciones de mitigación y adaptación comunes en todos los municipios que la conformen. Para ello, es posible alcanzar Pactos y aprobar Estrategias que busquen la reducción de accidentes graves por desastres, la mejora de la calidad del aire, la reducción del impacto ambiental negativo per cápita, la gestión de los residuos y otros muchos objetivos. "]
["3.1.10","Fomentar campañas de mejora de la educación y la sensibilización sobre la mitigación del cambio climático en la que los usos y los hábitos de consumo desempeñen un papel clave."]
["3.1.11","Fomentar la participación ciudadana y la educación a la ciudadanía como eje importante en el cuidado del medioambiente, sobre todo del medioambiente urbano."]
["3.1.12","Poner en marcha una gobernanza para la gestión del riesgo verdaderamente democrática, es decir, con implicación de todos los interesados (expertos, gobiernos, sector privado, sociedad civil, etc.) en la deliberación y también en la propia gestión."]
["3.2","Reducir las emisiones de gases de efecto invernadero. ","A1","A2","A3","A4","A5","A6","A7","A8","A9","A10","A11","A12","A13","A14","A15","A16","A17","A18","A19","A20","A21","A22","A23","A24","A25","A26","A27","A28","A29","A30"]
["3.2.1","Incentivar e impulsar un modelo urbano bajo en carbono, siguiendo las medidas y recomendaciones nacionales e internacionales (servicios públicos, infraestructuras, edificación, etc.)"]
["3.2.2","Ordenar los usos del suelo y de la edificación teniendo en cuenta aspectos bioclimáticos de eficiencia energética y de funcionalidad."]
["3.2.3","Implementar las estrategias “cero emisiones” en los entornos urbanos."]
["3.2.4","Reducir la dependencia del vehículo privado mediante el fomento de un modelo urbano compacto y complejo y los impactos de los desplazamientos motorizados. Ello redundará también en la reducción de sus consumos y emisiones contaminantes."]
["3.2.5","Utilizar tecnologías limpias, materiales y productos que eliminen o minimicen las emisiones contaminantes y de gases de efecto invernadero."]
["3.2.6","Promover la renovación del parque de vehículos."]
["3.3","Mejorar la resiliencia frente al cambio climático.","A1","A2","A3","A4","A5","A6","A7","A8","A9","A10","A11","A12","A13","A14","A15","A16","A17","A18","A19","A20","A21","A22","A23","A24","A25","A26","A27","A28","A29","A30"]
["3.3.1","Elaborar planes de resiliencia frente al cambio climático y garantizar que, cuando existan, sean conocidos y de fácil acceso a los ciudadanos. Aprovechar esta herramienta para preservar y mejorar las condiciones de vida."]
["3.3.2","Aprovechar el paisaje como oportunidad y valor de cada pueblo y ciudad, incorporar el término de “restauración ecológica” y transformar en el imaginario colectivo las zonas verdes en modelos autóctonos que permitan realizar una gestión eficiente de los recursos. "]
["3.3.3","Prepararse para ser resilientes, es decir, para hacer frente a las posibles crisis (suministros, huelgas, averías, desastres naturales, etc.) antes de que lleguen. Ello requiere evaluar los distintos escenarios estudiando qué elementos del sistema urbano están más implicados, hacer test de estrés, optimizar las inversiones para reducir los riesgos y evitar los posibles fallos en cadena. Un diagnóstico adecuado, la colaboración de todos los actores necesarios, incluyendo a la sociedad civil y la evaluación de la resiliencia en anteriores crisis pueden ser muy útiles. Para ello se propone la aprobación de protocolos de actuación.  "]
["3.3.4","Cuidar la forma espacial de la ciudad, su morfología (rugosidad urbana, cañón urbano, visibilidad del cielo, etc.), la presencia de vegetación, o el albedo de los materiales de las superficies urbana para minimizar el impacto de las olas de calor, que ven incrementados sus efectos por la denominada “isla de calor urbana”. Aplicar criterios bioclimáticos en el diseño de los espacios abiertos. "]
["3.3.5","Tener en cuenta en la planificación y en el diseño urbano, así como en el diseño y construcción de los edificios, el fenómeno de la isla de calor urbana. Para ello será preciso estudiar la influencia de clima regional y local y elaborar un mapa de clima urbano, en el que se analice la capacidad de absorción y cesión de calor por parte de los materiales urbanos (mapa de sobrecalentamiento) y la capacidad de eliminación de ese calor (mapa de ventilación urbana). Para la construcción de edificios se estudiarán soluciones de arquitectura bioclimática que contribuyan a reducir las emisiones de Gases de Efecto Invernadero."]
["3.3.6","Fomentar la conservación de especies animales y vegetales autóctonas. Aumentar la superficie de suelo capaz de sostener vegetación y mejorar la permeabilidad."]
["3.3.7","Desarrollar proyectos específicos de prevención de daños por inundaciones."]
["3.3.8","Reducir la deforestación y mejorar los ecosistemas."]
[]
[null,{"$f":"TABLAS!$AL$2","v":"BASES PARA LA ELABORACIÓN DE UNA ESTRATEGIA DE REHABILITACIÓN DEL ENTORNO CONSTRUIDO"},{"$f":"IF(C$1=\"\",\"\",C$1)","v":"Error: sin asignar."},{"$f":"IF(D$1=\"\",\"\",D$1)","v":"Error: sin asignar."},"Error: sin asignar.","Error: sin asignar.","Error: sin asignar.","Error: sin asignar.","","","","","","","","","","","","","","","","","","","","","","","",""]
[null,{"$f":"IF($B$2=\"\",\"\",$B$2)","v":"ETAPA III: PROGRAMA DE ACTUACIONES"}]
[null,{"$f":"TABLAS!$AL$4","v":""}]
["LÍNEAS DE ACTUACIÓN",null,"ACCIONES"]
[4,"HACER UNA GESTIÓN SOSTENIBLE DE LOS RECURSOS Y FAVORECER LA ECONOMÍA CIRCULAR","A.1","A.2","A.3","A.4","A.5","A.6","A.7","A.8","A.9","A.10","A.11","A.12","A.13","A.14","A.15","A.16","A.17","A.18","A.19","A.20","A.21","A.22","A.23","A.24","A.25","A.26","A.27","A.28","A.29","A.30"]
["4.1","Ser más eficientes energéticamente y ahorrar energía."]
["4.1.1","Apoyar la transición energética en y de las ciudades: en ellas están las claves. La generación distribuida y el autoconsumo de energía en el ámbito urbano son herramientas básicas para ese cambio de modelo energético. "]
["4.1.2","Contener e incluso reducir el gasto de energía, fomentar su ahorro y promover la eficiencia energética a través de planes, estrategias u otras medidas. Entre ellas: tener en cuenta la morfología urbana y las condiciones bioclimáticas de la ciudad; incorporar criterios de arquitectura bioclimática pasiva o maximizar la prestación de los servicios de calefacción, refrigeración o iluminación, con el mínimo consumo posible."]
["4.1.3","Incluir medidas de prevención y resiliencia que prevengan y reduzcan al máximo los riesgos energéticos (v.g. redes eléctricas que permiten el suministro alternativo, etc.)"]
["4.1.4","Incluir objetivos de descarbonización."]
["4.1.5","Fomentar el uso de energías renovables térmicas, de manera especial en el parque edificatorio, que debería aprovechar su relativa baja demanda energética y su potencial de captación solar."]
["4.1.6","Fomentar el uso compartido de redes de infraestructuras para los distintos servicios urbanos. "]
["4.1.7","Fomentar el uso de la energía eléctrica en la medida en que permita contribuir a los objetivos de eficiencia energética y energías renovables y deslocalizar las emisiones fuera de las ciudades."]
["4.1.8","Diseñar ordenanzas y alineaciones que propicien la ubicación inteligente de los edificios teniendo en cuenta las necesidades reales de los usuarios."]
["4.1.9","Contar con sistemas de energía resilientes, es decir, que toleren las posibles perturbaciones sin cortar el suministro de energía a los consumidores. La generación distribuida de origen renovable, o generación in-situ, permite contar con generación de energía por medio de variadas fuentes situadas en lugares lo más próximos posibles a las cargas."]
["4.1.10","Facilitar el autoconsumo en cubiertas municipales, mobiliario urbano, aparcamientos en superficie, etc., y la incentivación del autoconsumo en las cubiertas de edificios privados a través de medidas fiscales en el ámbito local (licencias de obra, IBI, etc.) "]
["4.1.11","Fomentar la contratación de servicios energéticos en los edificios públicos."]
["4.2","Optimizar y reducir el consumo de agua.","A1","A2","A3","A4","A5","A6","A7","A8","A9","A10","A11","A12","A13","A14","A15","A16","A17","A18","A19","A20","A21","A22","A23","A24","A25","A26","A27","A28","A29","A30"]
["4.2.1","Adoptar medidas para disminuir el consumo de agua y del gasto energético y emisiones asociados a la distribución y tratamiento del recurso. "]
["4.2.2","Tratar y recuperar los cauces naturales de agua y los recursos subterráneos como base de los abastecimientos urbanos, aplicando, si es necesario, las nuevas tecnologías de tratamiento (ósmosis inversa, nanofiltración) para alcanzar una máxima calidad. "]
["4.2.3","Desarrollar una política de protección de las zonas de recarga de los acuíferos destinados total o parciamente al abastecimiento, evitando la implantación de actividades que puedan afectar a su calidad. "]
["4.2.4","Respetar y valorar en la distribución de usos del suelo las zonas húmedas."]
["4.2.5","Realizar estrictos seguimientos de los procesos territoriales y de las actuaciones que pueden generar contaminación difusa con posibilidad de afectar a los recursos de agua con destino a las ciudades."]
["4.2.6","Independizar, siempre que sea posible, los recursos superficiales para uso urbano, de los destinados a otros usos, protegiendo de modo efectivo las zonas de captación."]
["4.2.7","Adecuar la calidad del agua para cada uso concreto, fomentando la utilización de sistemas de aprovechamiento de aguas grises."]
["4.2.8","Fomentar la recogida selectiva, las redes separativas de saneamiento y asegurar la proximidad del usuario a dichos sistemas para favorecer esta actividad. "]
["4.2.9","Construir sistemas de depuración de aguas no agresivos con el entorno. A nivel local, aplicar tratamientos que eviten la devolución del agua a la naturaleza contaminándola o destruyendo la biodiversidad."]
["4.2.10","Fomentar tipos edificatorios con menor demanda de agua y con sistemas de recogida y reutilización de aguas pluviales."]
["4.2.11","Utilizar sistemas de retención y filtración de aguas pluviales, fomentar el empleo de pavimentos permeables e incluir diseños de jardinería autóctona o ahorradora de agua mediante los sistemas eficientes de riego. "]
["4.3","Fomentar el ciclo de los materiales.","A1","A2","A3","A4","A5","A6","A7","A8","A9","A10","A11","A12","A13","A14","A15","A16","A17","A18","A19","A20","A21","A22","A23","A24","A25","A26","A27","A28","A29","A30"]
["4.3.1","Conseguir un progresivo cierre de ciclos en el metabolismo de las ciudades, impulsando la reducción en origen de los residuos, la inclusión de criterios de “ciclo de vida” en el consumo de materiales y la reutilización y el reciclaje. "]
["4.3.2","Fomentar el consumo responsable, las iniciativas de reparación, reutilización y re-fabricación y los sistemas colaborativos y compartidos de bienes y servicios. "]
["4.3.3","Fomentar el empleo de materias primas secundarias y fácilmente reciclables procedentes de entornos locales."]
["4.3.4","Adoptar medidas para separar en origen y gestionar los residuos procedentes de la construcción e incorporarlos en las nuevas obras de edificación o rehabilitación. cuando técnica, ambiental y normativamente sea posible, y fomentar la aprobación de planes de reutilización de los residuos de la construcción. "]
["4.3.5","Potenciar la producción bajo los parámetros de ecodiseño (materiales ecológicos, reutilizables y valorizables) y fomentar su consumo."]
["4.3.6","Aprobar e implantar planes de renovación de infraestructuras municipales."]
["4.3.7","Proponer planes de actuación sobre las propias actividades a realizar en los servicios públicos."]
["4.3.8","Establecer criterios de compra pública circular en el ámbito local que permitan cerrar el ciclo de los materiales incluyendo la compra y uso de productos y materiales de segunda mano. En especial, habría que fomentar la utilización de los criterios sobre el ciclo de vida de los materiales en la contratación pública."]
["4.4","Reducir los residuos y favorecer su reciclaje.","A1","A2","A3","A4","A5","A6","A7","A8","A9","A10","A11","A12","A13","A14","A15","A16","A17","A18","A19","A20","A21","A22","A23","A24","A25","A26","A27","A28","A29","A30"]
["4.4.1","Potenciar el uso de sistemas de depósito, devolución y retorno, con el consiguiente ahorro de recursos e impactos ambientales y socioeconómicos. Esta línea de actuación es básica para el desarrollo de una economía circular, como también lo son los planes de gestión de residuos o instrumentos equivalentes."]
["4.4.2","Reservar desde el planeamiento las zonas más adecuadas para solucionar los problemas de recogida y tratamiento de los residuos y garantizar que existan, en cantidad y calidad suficientes. En especial, deberían preverse reservas de suelo para compostaje y tratamiento de residuos vegetales y bioresiduos."]
["4.4.3","Disociar la generación de los residuos del desarrollo económico mediante iniciativas de prevención de los residuos, con un uso más eficaz de los recursos y con un cambio hacia pautas de consumo más sostenibles. "]
["4.4.4","Gestionar los residuos para reducir su impacto, obligando al tratamiento de los mismos (sean peligrosos o no)."]
["4.4.5","Fomentar la separación en origen de los residuos textiles, de la fracción orgánica y proceder a la gestión de los mismos, así como potenciar las recogidas comerciales en origen. "]
["4.4.6","Estudiar y aplicar nuevos modelos de educación ambiental para crear conciencia ambiental y sensibilidad hacia el consumo y la generación de residuos."]
[]
[null,{"$f":"TABLAS!$AL$2","v":"BASES PARA LA ELABORACIÓN DE UNA ESTRATEGIA DE REHABILITACIÓN DEL ENTORNO CONSTRUIDO"},{"$f":"IF(C$1=\"\",\"\",C$1)","v":"Error: sin asignar."},{"$f":"IF(D$1=\"\",\"\",D$1)","v":"Error: sin asignar."},"Error: sin asignar.","Error: sin asignar.","Error: sin asignar.","Error: sin asignar.","","","","","","","","","","","","","","","","","","","","","","","",""]
[null,{"$f":"IF($B$2=\"\",\"\",$B$2)","v":"ETAPA III: PROGRAMA DE ACTUACIONES"}]
[null,{"$f":"TABLAS!$AL$4","v":""}]
["LÍNEAS DE ACTUACIÓN",null,"ACCIONES"]
[5,"FAVORECER LA PROXIMIDAD Y LA MOVILIDAD SOSTENIBLE","A.1","A.2","A.3","A.4","A.5","A.6","A.7","A.8","A.9","A.10","A.11","A.12","A.13","A.14","A.15","A.16","A.17","A.18","A.19","A.20","A.21","A.22","A.23","A.24","A.25","A.26","A.27","A.28","A.29","A.30"]
["5.1","Favorecer la ciudad de proximidad."]
["5.1.1","Fomentar un modelo urbano de usos mixtos que reduzca distancias en los viajes dentro de la ciudad."]
["5.1.2","Promover la conectividad urbana y la accesibilidad universal, con patrones de proximidad entre la residencia y el trabajo, para limitar las exigencias de movilidad. "]
["5.1.3","Establecer en los instrumentos de ordenación un reparto equilibrado del espacio urbano destinado a movilidad motorizada y no motorizada, acorde con las políticas de desarrollo sostenible de las ciudades. "]
["5.1.4","Priorizar, en la medida de lo posible, la ciudad para el peatón favoreciendo los itinerarios continuos, seguros y responsables y propiciando una forma de vida más saludable y activa."]
["5.1.5","Fomentar la eficacia y la calidad de los modos de transporte más económicos y al alcance de todos los grupos de edad: transporte público, bicicleta y a pie. "]
["5.1.6","Implementar modelos de desarrollo urbanístico que incorporen planes de transporte público."]
["5.1.7","Fomentar cadenas metropolitanas o supramunicipales de transporte público y promover su intermodalidad. "]
["5.1.8","Desarrollar redes peatonales y ciclistas, incluyendo los nuevos desarrollos urbanos, garantizando desplazamientos no motorizados seguros y en un entorno amigable. Elaborar ordenanzas de coexistencia de ciclistas y peatones."]
["5.1.9","Adoptar medidas para fomentar la elaboración de planes de transporte al trabajo en los principales centros de actividad económica del área urbana para racionalizar los desplazamientos a los centros de trabajo, así como estrategias de teletrabajo."]
["5.1.10","Establecer plataformas logísticas de distribución en cada barrio y gestionar la distribución de mercancías en las zonas urbanas, maximizando los centros de consolidación/ruptura de cargas y evitando la distribución con bajo nivel de carga de furgonetas y camiones."]
["5.2","Potenciar modos de transporte sostenibles.","A1","A2","A3","A4","A5","A6","A7","A8","A9","A10","A11","A12","A13","A14","A15","A16","A17","A18","A19","A20","A21","A22","A23","A24","A25","A26","A27","A28","A29","A30"]
["5.2.1","Adoptar medidas a través de planes de movilidad urbana sostenible, para reducir los viajes en transporte privado, fomentar los sistemas de transporte público eficientes y mejorar la calidad de los desplazamientos peatonales. En estos planes debería fijarse la prioridad peatonal en la circulación urbana. "]
["5.2.2","Establecer una oferta adecuada de transporte público a escala urbana y construir redes integradas que interconecten los distintos modos. "]
["5.2.3","Diseñar intercambiadores de transporte que actúen como nodos de transferencia entre viajes interurbanos y urbanos."]
["5.2.4","Dotarse de una estrategia integral que incluya políticas de disuasión de la utilización de vehículos contaminantes, dentro de un plan o programa más amplio que incluya otras alternativas. En tal sentido, el paso de los actuales Planes de movilidad a planes estratégicos que potencien las objetivos estratégicos de la Agenda sería muy recomendable."]
["5.2.5","Ubicar aparcamientos de disuasión en la periferia urbana, facilitando la transferencia del usuario de un vehículo privado al transporte público o al vehículo compartido. "]
["5.2.6","Ubicar las actividades periféricas, que atraen gran número de viajes, en puntos de alta accesibilidad a los ejes de transportes y a los nodos de la red de transporte público. "]
["5.2.7","Impulsar y favorecer el uso de vehículos de energías alternativas e híbridos. Implantar puntos de recarga de coches eléctricos."]
["5.2.8","Promover una visión integrada de la movilidad al servicio del ciudadano (MaaS, Mobility as a Service), y fomentar medidas que impulsen los sistemas de vehículo compartido, así como los servicios cooperativos ligados al transporte público."]
["5.2.9","Potenciar la movilidad ciclista mediante el diseño de vías exclusivas o prioritarias y aparcamientos para bicicletas."]
["5.2.10","Integrar la bicicleta con el transporte público e impulsar las iniciativas de oferta de bicicleta compartida. "]
["5.2.11","Integrar las redes peatonales y ciclistas con las zonas verdes, garantizando desplazamientos no motorizados seguros y en un entorno amigable."]
["5.2.12","Garantizar la accesibilidad universal en todos los sistemas de transporte."]
[]
[null,{"$f":"TABLAS!$AL$2","v":"BASES PARA LA ELABORACIÓN DE UNA ESTRATEGIA DE REHABILITACIÓN DEL ENTORNO CONSTRUIDO"},{"$f":"IF(C$1=\"\",\"\",C$1)","v":"Error: sin asignar."},{"$f":"IF(D$1=\"\",\"\",D$1)","v":"Error: sin asignar."},"Error: sin asignar.","Error: sin asignar.","Error: sin asignar.","Error: sin asignar.","","","","","","","","","","","","","","","","","","","","","","","",""]
[null,{"$f":"IF($B$2=\"\",\"\",$B$2)","v":"ETAPA III: PROGRAMA DE ACTUACIONES"}]
[null,{"$f":"TABLAS!$AL$4","v":""}]
["LÍNEAS DE ACTUACIÓN",null,"ACCIONES"]
[6," FOMENTAR LA COHESIÓN SOCIAL Y BUSCAR LA EQUIDAD","A.1","A.2","A.3","A.4","A.5","A.6","A.7","A.8","A.9","A.10","A.11","A.12","A.13","A.14","A.15","A.16","A.17","A.18","A.19","A.20","A.21","A.22","A.23","A.24","A.25","A.26","A.27","A.28","A.29","A.30"]
["6.1","Reducir el riesgo de pobreza y exclusión social en entornos urbanos desfavorecidos."]
["6.1.1","Promover una ciudad compleja y de proximidad, basada en barrios bien equipados y seguros, bien conectados con la ciudad y el territorio. "]
["6.1.2","Identificar aquellos barrios o entornos urbanos que presenten un mayor grado de vulnerabilidad social, económica y ambiental como áreas de actuación preferente para favorecer la equidad en el desarrollo urbano y luchar contra las bolsas de pobreza, la exclusión social y la desigualdad. Los Observatorios de Barrios Vulnerables son herramientas útiles a dichos efectos."]
["6.1.3","Fomentar la renovación y regeneración urbana integrada especialmente en entornos urbanos desfavorecidos o barrios de mayor vulnerabilidad urbana. A tales efectos podrían abordarse planes de carácter integrado e integral."]
["6.1.4","Incluir en los planes y programas de carácter social que se elaboren y aprueben medidas para hacer efectivo el principio de igualdad de oportunidades y de trato entre mujeres y hombres y los compromisos específicos para llevar a cabo las medidas que combaten los efectos negativos y los obstáculos que tienen las mujeres como consecuencia de las múltiples discriminaciones."]
["6.1.5","Fomentar la creación o mejora de servicios sociales dirigidos a personas en riesgo de exclusión social y promover campañas de difusión de los servicios existentes para conocimiento de la ciudadanía. Adaptar los sistemas de acogida de personas y hogares en situación de vulnerabilidad a las necesidades actuales, incluyendo los flujos migratorios."]
["6.1.6","Promover la asequibilidad de los servicios municipales para los colectivos más vulnerables."]
["6.1.7","Promover y favorecer la actividad económica y comercial en estos entornos urbanos como medida de revitalización de los barrios y de generación de empleo local."]
["6.1.8","Reducir los niveles de desigualdad, el riesgo de pobreza y la exclusión social a través de medidas que actúen en los niveles de segregación espacial, residencial y disimilitud."]
["6.1.9","Promover el uso del espacio público y la convivencia ciudadana como elementos de cohesión social. Convertir las calles en plazas, no sólo como espacios de disfrute y convivencia comunes, sino también como espacios públicos inclusivos. Garantizar la accesibilidad universal a los mismos."]
["6.1.10","Promover iniciativas comunitarias sin fines de lucro que posibiliten el uso del espacio público."]
["6.1.11","Reforzar el sentido de pertenencia a un lugar como seña de identidad y el conocimiento del entorno más próximo."]
["6.1.12","Elaborar políticas relativas a la seguridad pública y a la prevención de la delincuencia y la violencia evitando la estigmatización de colectivos vulnerables."]
["6.1.13","Adoptar medidas de prevención y lucha contra el abandono escolar. "]
["6.1.14","Actuar específicamente en la reducción de la desigualdad, el riesgo de pobreza y la exclusión social eliminando la infravivienda y el chabolismo."]
["6.1.15","Adoptar medidas de apoyo a la formación y el acceso al empleo."]
["6.2","Buscar la igualdad de oportunidades desde una perspectiva de género, edad y capacidad.","A1","A2","A3","A4","A5","A6","A7","A8","A9","A10","A11","A12","A13","A14","A15","A16","A17","A18","A19","A20","A21","A22","A23","A24","A25","A26","A27","A28","A29","A30"]
["6.2.1","Adoptar medidas a través de planes o estrategias para garantizar la igualdad de trato y de oportunidades, el acceso al mercado de trabajo y la vida pública en condiciones de igualdad que garanticen la no discriminación por motivo de origen racial o étnico, discapacidad, identidad sexual, orientación sexual y de género, religión, opinión o cualquier otra condición o circunstancia personal o social."]
["6.2.2","Integrar la perspectiva de género, edad y capacidad en los temas relacionados con el día a día de las ciudades, en las estructuras administrativas y en los procesos de toma de decisiones."]
["6.2.3","Adoptar medidas para la detección temprana de la vulnerabilidad o exclusión social en relación a los procesos de ocupación ilegal de suelo y edificios, contando con espacios y servicios de coordinación entre Servicios Sociales, Vivienda, Seguridad ciudadana y Salud para el acompañamiento de las personas más vulnerables"]
["6.2.4","Garantizar un nivel adecuado de prestaciones sociales para las personas con discapacidad y en situación de dependencia. "]
["6.2.5","Aumentar la seguridad ciudadana en los espacios urbanos adoptando las medidas adecuadas de diseño urbano (iluminación, mobiliario, etc.) "]
["6.2.6","Aumentar la dotación de parques en áreas residenciales, frecuentados principalmente por ancianos, mujeres y niños, garantizando una adecuada accesibilidad, iluminación y seguridad. "]
["6.2.7","Definir itinerarios pavimentados que facilitan la accesibilidad universal, que estén adecuadamente iluminados y con superficie de sombra suficiente para disfrutar de zonas de esparcimiento."]
["6.2.8","Apoyar la “movilidad del cuidado” asegurando que los viajes vinculados al cuidado de otras personas y el mantenimiento del hogar se puedan desarrollar en el menor tiempo posible, en las franjas horarias requeridas y con un coste asumible."]
["6.2.9","Fomentar el conocimiento experto en la perspectiva de género, edad y discapacidad y el urbanismo simultáneamente y difundirlo entre la ciudadanía, tratando de eliminar viejos clichés. "]
["6.2.10","Fomentar programas de voluntariado, actividades sociales, etc. que favorezcan la interrelación entre las personas que viven solas y su socialización con los vecinos del barrio, pueblo o ciudad."]
["6.2.11","Identificar y difundir buenas prácticas de planificación urbanística, arquitectónica y de movilidad urbana y rural, que incidan favorablemente en la conciliación de la vida personal, familiar y laboral, así como en la autonomía de las personas."]
["6.2.12","Educar para la igualdad de trato por origen racial o étnico, discapacidad, identidad sexual, orientación sexual y de género, religión, opinión o cualquier otra condición o circunstancia personal o social, la igualdad de género y la corresponsabilidad. "]
["6.2.13","Fomentar la creación de actividades sociales, culturales, etc., que favorezcan la integración intercultural, desde una perspectiva educativa, social, etc."]
["6.2.14","Fomentar el asociacionismo de barrio."]
["6.2.15","Integrar transversalmente de forma activa el principio de igualdad de trato por origen racial o étnico, discapacidad, identidad sexual, orientación sexual y de género, religión, opinión o cualquier otra condición o circunstancia personal o social, y el principio de igualdad de género en la elaboración, ejecución y seguimiento de las disposiciones normativas, en la definición y presupuestos de las políticas públicas en todos los ámbitos y en el desarrollo del conjunto de todas sus actividades, considerando sistemáticamente las prioridades y necesidades propias de las mujeres, teniendo en cuenta su incidencia en su situación específica, al objeto de adaptarlas para eliminar los efectos discriminatorios y promover la igualdad."]
[]
[null,{"$f":"TABLAS!$AL$2","v":"BASES PARA LA ELABORACIÓN DE UNA ESTRATEGIA DE REHABILITACIÓN DEL ENTORNO CONSTRUIDO"},{"$f":"IF(C$1=\"\",\"\",C$1)","v":"Error: sin asignar."},{"$f":"IF(D$1=\"\",\"\",D$1)","v":"Error: sin asignar."},"Error: sin asignar.","Error: sin asignar.","Error: sin asignar.","Error: sin asignar.","","","","","","","","","","","","","","","","","","","","","","","",""]
[null,{"$f":"IF($B$2=\"\",\"\",$B$2)","v":"ETAPA III: PROGRAMA DE ACTUACIONES"}]
[null,{"$f":"TABLAS!$AL$4","v":""}]
["LÍNEAS DE ACTUACIÓN",null,"ACCIONES"]
[7,"IMPULSAR Y FAVORECER LA ECONOMÍA URBANA","A.1","A.2","A.3","A.4","A.5","A.6","A.7","A.8","A.9","A.10","A.11","A.12","A.13","A.14","A.15","A.16","A.17","A.18","A.19","A.20","A.21","A.22","A.23","A.24","A.25","A.26","A.27","A.28","A.29","A.30"]
["7.1","Buscar la productividad local, la generación de empleo y la dinamización y diversificación de la actividad económica. "]
["7.1.1","Introducir las medidas necesarias para coordinar la ordenación territorial y urbanística con la planificación sectorial de las actividades económicas, con estrategias específicas para los pequeños núcleos de población y otros núcleos con tendencia a la despoblación. "]
["7.1.2","Favorecer actuaciones que permitan diversificar la estructura productiva y generar oportunidades de empleo que garanticen la calidad de vida. "]
["7.1.3","Adelantar medidas que tengan en cuenta la pérdida de empleos previsible por la robotización inminente de muchos procedimientos."]
["7.1.4","Impulsar la red de ciudades intermedias como polos de actividad regionales."]
["7.1.5","Garantizar la compatibilidad de las actividades económicas con los tejidos residenciales para generar empleo y mejorar los tejidos productivos y, en su caso, flexibilizar los instrumentos de ordenación urbanística para poder responder a la demanda real. "]
["7.1.6","Fomentar la innovación, el uso de las nuevas tecnologías y el conocimiento para lograr una actividad económica competitiva y una mayor oferta de empleo. "]
["7.1.7","Fomentar el acceso a nuevos modos de consumo, el comercio electrónico y aprovechar las ventajas de la economía circular. "]
["7.1.8","Favorecer las actividades económicas en el ámbito rural y la producción local, la alimentación de proximidad -para lograr la máxima interconexión entre los ámbitos rural y urbano- y tratar de limitar al máximo el transporte de los alimentos para consumir menos recursos y favorecer la alimentación de temporada más sana y medioambientalmente más recomendable."]
["7.1.9","Incentivar el sector primario como recurso económico de los municipios con valores agrológicos significativos."]
["7.1.10","Potenciar la riqueza del tejido asociativo y crear una estructura de colaboración implicada en el barrio o área urbana lo más amplia posible. "]
["7.1.11","Fomentar la economía social: el asociacionismo, las sociedades laborales, las cooperativas y las mutualidades que persigan intereses generales. "]
["7.1.12","Generar espacios atractivos para la actividad económica y el comercio local y reservar espacios para  comercializar los productos locales."]
["7.1.13","Prever y fomentar espacios de trabajo flexibles (coworking) en el centro de las ciudades, tanto por su capacidad de atraer a nuevos emprendedores, como por abaratar el precio del alquiler convencional de las oficinas. "]
["7.1.14","Crear bases estadísticas municipales que permitan a las ciudades tener un mejor conocimiento de las dinámicas económicas locales."]
["7.1.15","Conseguir una estrategia de estandarización en los datos que consiga un acceso real y efectivo a la información que pueda ser relevante para los ciudadanos. Ello significa jerarquizar los datos de manera homogénea para que puedan cruzarse en sus respectivos niveles (nacional, autonómico y local) en el espacio y en el tiempo."]
["7.1.16","Garantizar la correspondencia entre la prestación de los servicios municipales con la suficiencia financiera local a través de la elaboración y seguimiento de informes de sostenibilidad económica."]
["7.1.17","Adelantar medidas que tengan en cuenta la pérdida de empleos previsible por la cuarta revolución tecnológica. Especialmente por la derivada del comercio electrónico."]
["7.1.18","Fomentar la conciliación laboral y la igualdad de oportunidades en el acceso al trabajo."]
["7.2","Fomentar el turismo inteligente, sostenible y de calidad y los sectores clave de la economía local.","A1","A2","A3","A4","A5","A6","A7","A8","A9","A10","A11","A12","A13","A14","A15","A16","A17","A18","A19","A20","A21","A22","A23","A24","A25","A26","A27","A28","A29","A30"]
["7.2.1","Impulsar la realización de diagnósticos y planes de acción de destino turístico inteligente para la mejora de la sostenibilidad y la competitividad de los destinos turísticos."]
["7.2.2","Promover la aplicación de normas públicas UNE y sistemas de distinción en materia de calidad turística o de mejora de la gestión turística como la Q de Calidad o el SICTED (Sistema Integral de Calidad Turística en Destinos) o el distintivo de Destino Turístico Inteligente."]
["7.2.3","Realizar planes turísticos que tengan una visión integrada en la que se recojan acciones a largo plazo y en los que se permita participar de manera efectiva a las comunidades locales. "]
["7.2.4","Impulsar el turismo urbano sostenible que gestione los flujos de visitantes y la capacidad de carga de los espacios históricos, evitando el efecto de masificación, que sea respetuoso con el patrimonio cultural y que garantice el equilibrio entre el turismo y el bienestar para las comunidades receptoras. "]
["7.2.5","Regenerar y reconvertir los destinos turísticos maduros para dotarlos de unos estándares de calidad actuales. "]
["7.2.6","Apostar por la cultura, la gastronomía y los productos locales como recursos propios y existentes. "]
["7.2.7","Desarrollar planes de marketing turístico que tengan como objetivos primarios los perfiles de turistas de calidad, de alta rentabilidad en el destino urbano que visita, y con un nivel cultural que permita valorar el patrimonio de la ciudad. "]
["7.2.8","Conseguir la desestacionalización del turismo, revalorizando los recursos que fomenten el equilibrio socio-territorial, creando nuevas categorías de producto que sean capaces de operar todo el año. "]
["7.2.9","Favorecer el ecoturismo y el turismo rural como forma de dinamizar económicamente y de forma sostenible, entornos y núcleos territoriales en regresión, con el fin de diversificar la demanda de actividad y de sectores económicos. "]
["7.2.10","Disponer de oferta hacia un turismo especializado con actividades ligadas a la innovación, la creatividad y el ocio. "]
[]
[]
[null,{"$f":"TABLAS!$AL$2","v":"BASES PARA LA ELABORACIÓN DE UNA ESTRATEGIA DE REHABILITACIÓN DEL ENTORNO CONSTRUIDO"},{"$f":"IF(C$1=\"\",\"\",C$1)","v":"Error: sin asignar."},{"$f":"IF(D$1=\"\",\"\",D$1)","v":"Error: sin asignar."},"Error: sin asignar.","Error: sin asignar.","Error: sin asignar.","Error: sin asignar.","","","","","","","","","","","","","","","","","","","","","","","",""]
[null,{"$f":"IF($B$2=\"\",\"\",$B$2)","v":"ETAPA III: PROGRAMA DE ACTUACIONES"}]
[null,{"$f":"TABLAS!$AL$4","v":""}]
["LÍNEAS DE ACTUACIÓN",null,"ACCIONES"]
[8,"GARANTIZAR EL ACCESO A LA VIVIENDA","A.1","A.2","A.3","A.4","A.5","A.6","A.7","A.8","A.9","A.10","A.11","A.12","A.13","A.14","A.15","A.16","A.17","A.18","A.19","A.20","A.21","A.22","A.23","A.24","A.25","A.26","A.27","A.28","A.29","A.30"]
["8.1","Fomentar la existencia de un parque de vivienda adecuado a precio asequible."]
["8.1.1","Asegurar que el suelo vinculado al uso residencial por la ordenación territorial y urbanística esté al servicio de la efectividad del derecho a disfrutar de una vivienda digna y adecuada. Para ello es preciso fomentar el uso efectivo de las viviendas que estén vacías en aquellas zonas en las que exista una demanda real y acreditada así como, en su caso, utilizar las medidas, tanto de fomento como incluso coercitivas, que sean precisas, para garantizar que se cumple la función social de la propiedad y el destino prioritario de las viviendas al uso residencial previsto por el planeamiento urbanístico."]
["8.1.2","Promover medidas de acción positiva en la garantía del derecho a acceder a una vivienda digna y adecuada, tanto por medio de la vivienda de titularidad pública, como mediante medidas de fomento que faciliten la puesta en el mercado de viviendas suficientes a precios asequibles."]
["8.1.3","Propiciar una visión integral de la vivienda como un elemento que se integra en un entorno adecuado."]
["8.1.4","Garantizar unas determinadas reservas de suelo para vivienda sujeta a algún régimen de protección pública en el propio planeamiento, con un criterio de reparto de las mismas que respete la cohesión social e impida la formación de guetos. "]
["8.1.5","Impulsar la generación de viviendas dotacionales públicas o de viviendas sociales en las que esté garantizada la titularidad pública de forma indefinida."]
["8.1.6","Favorecer el alquiler para equilibrar esta forma de tenencia con la vivienda en propiedad. "]
["8.1.7","Mejorar la seguridad, la habitabilidad, la accesibilidad universal y la eficiencia energética de las viviendas."]
["8.1.8","Incluir a las personas con discapacidad como beneficiarios específicos en los planes y programas que ayuden al acceso a una vivienda para colectivos vulnerables."]
["8.1.9","Evitar la gentrificación. Delimitar ámbitos de tanteo y retracto en los que la Administración Pública pueda adquirir inmuebles para fomentar el alquiler social. También serviría a este mismo fin la adquisición finalista de viviendas dentro de los ámbitos que han sido objeto de una operación de regeneración urbana con importante financiación pública."]
["8.1.10","Avanzar en un concepto de habitabilidad adaptado a las necesidades motivadas por las nuevas configuraciones familiares y a las actuales condiciones de vida."]
["8.2","Garantizar el acceso a la vivienda, especialmente de los colectivos más vulnerables.","A1","A2","A3","A4","A5","A6","A7","A8","A9","A10","A11","A12","A13","A14","A15","A16","A17","A18","A19","A20","A21","A22","A23","A24","A25","A26","A27","A28","A29","A30"]
["8.2.1","Impulsar la creación de parques públicos y privados de vivienda a precios asequibles, que permitan atender, especialmente, las necesidades de las personas más vulnerables mediante el alquiler. En concreto, disponer de un parque de vivienda social suficiente para atender las situaciones de mayor vulnerabilidad social. Entre éstas últimas, también las de las personas a las que ha sobrevenido una discapacidad (por accidente, evento de salud, envejecimiento, etc.), que, por esa razón, ya no pueden permanecer en la vivienda en la que residían."]
["8.2.2","Potenciar la vivienda social, no sólo a partir de nuevas promociones, sino mediante la activación e incorporación al mercado de viviendas desocupadas, promoviendo la rehabilitación del parque de vivienda. Esta vivienda debería tener como beneficiarios prioritarios a todas aquellas personas que se encuentren en situación de emergencia humanitaria o de exclusión social severa."]
["8.2.3","Fomentar las ayudas al alquiler y otras ayudas sociales, como las específicas para realizar obras de accesibilidad, de manera que se garantice el acceso a una vivienda de quiénes tienen mayores problemas para ello. "]
["8.2.4","Fomentar e incluso exigir normativamente la existencia de fondos de reserva en las comunidades de propietarios de edificios de tipología residencial colectiva que coadyuven a la realización de las obras de accesibilidad que sean necesarias."]
["8.2.5","Implantar protocolos tempranos de prevención de desahucios para evitar que se produzcan sin alojamientos alternativos, con medidas adecuadas de seguimiento y evaluación. "]
["8.2.6","Favorecer la consolidación de formas diversas de tenencia de la vivienda, aparte de la propiedad y el alquiler. En especial, las que ofrece y puede llegar a ofrecer el cooperativismo."]
[]
[null,{"$f":"TABLAS!$AL$2","v":"BASES PARA LA ELABORACIÓN DE UNA ESTRATEGIA DE REHABILITACIÓN DEL ENTORNO CONSTRUIDO"},{"$f":"IF(C$1=\"\",\"\",C$1)","v":"Error: sin asignar."},{"$f":"IF(D$1=\"\",\"\",D$1)","v":"Error: sin asignar."},"Error: sin asignar.","Error: sin asignar.","Error: sin asignar.","Error: sin asignar.","","","","","","","","","","","","","","","","","","","","","","","",""]
[null,{"$f":"IF($B$2=\"\",\"\",$B$2)","v":"ETAPA III: PROGRAMA DE ACTUACIONES"}]
[null,{"$f":"TABLAS!$AL$4","v":""}]
["LÍNEAS DE ACTUACIÓN",null,"ACCIONES"]
[9,"LIDERAR Y FOMENTAR LA INNOVACIÓN DIGITAL","A.1","A.2","A.3","A.4","A.5","A.6","A.7","A.8","A.9","A.10","A.11","A.12","A.13","A.14","A.15","A.16","A.17","A.18","A.19","A.20","A.21","A.22","A.23","A.24","A.25","A.26","A.27","A.28","A.29","A.30"]
["9.1","Favorecer la sociedad del conocimiento y avanzar hacia el desarrollo de las ciudades inteligentes (Smart cities)."]
["9.1.1","Promover el desarrollo de los destinos turísticos inteligentes como caso particular de las Smart Cities al servicio del desarrollo sostenible de destinos turísticos urbanos y rurales."]
["9.1.2","Adoptar medidas a través de planes o estrategias que favorezcan la incorporación de las nuevas tecnologías del conocimiento (Big data y Data Mining, Inteligencia Artificial) en la gestión urbana para avanzar en un modelo urbano inteligente. También deberían establecerse estrategias que avancen en un modelo de territorios inteligentes."]
["9.1.3","Impulsar la digitalización de las ciudades y de los servicios urbanos mediante modelos eficientes y sostenibles basados en plataformas digitales de gestión inteligente "]
["9.1.4","Facilitar el acceso a las redes de comunicaciones móviles modificando y adaptando las normativas autonómicas y locales a la nueva normativa estatal en la materia."]
["9.1.5","Impulsar el espacio público como eje vertebrador del acceso a las nuevas tecnologías por parte del ciudadano."]
["9.1.6","Considerar el despliegue de las comunicaciones electrónicas como un equipamiento básico de las ciudades que debe formar parte de las determinaciones estructurantes de los instrumentos de planeamiento."]
["9.1.7","Impulsar las tecnologías limpias en los procesos de información y de comunicación y en los sistemas inteligentes de transporte, así como en la gestión eficiente y sostenible de los recursos de la ciudad (energía, agua, residuos y medio ambiente urbano). "]
["9.1.8","Apostar por un desarrollo económico y competitivo de la ciudad basado en la innovación, la tecnología y un mejor aprovechamiento del capital social y humano."]
["9.2","Fomentar la Administración electrónica y reducir la brecha digital.","A1","A2","A3","A4","A5","A6","A7","A8","A9","A10","A11","A12","A13","A14","A15","A16","A17","A18","A19","A20","A21","A22","A23","A24","A25","A26","A27","A28","A29","A30"]
["9.2.1","Fomentar el gobierno abierto y transparente (portales open data) que se apoya en la tecnología para conseguir calidad y eficiencia en sus servicios y actividad y para incentivar la participación ciudadana en los procesos de decisión que afectan a la ciudad."]
["9.2.2","Promover la existencia de portales abiertos de información en los que se pueda acceder a datos en bruto y no manipulados, con los que posteriormente poder trabajar con garantía de certeza que favorezca, además, el intercambio de información entre las ciudades. "]
["9.2.3","Establecer mecanismos y estrategias de jerarquización y homogeneización de la información de manera que sea comparable en el espacio y en el tiempo y accesible para todos."]
["9.2.4","Aumentar los servicios de administración electrónica facilitando los procedimientos administrativos a ciudadanos y empresas."]
["9.2.5","Adoptar medidas de innovación tecnológica con aplicaciones que acerquen al ciudadano a los servicios públicos. También está relacionada con el vehículo eléctrico y autónomo…"]
["9.2.6","Disponer de estrategias de alfabetización digital de colectivos vulnerables (desempleados de larga duración, personas mayores, etc.) con el fin de reducir la brecha digital."]
["9.2.7","Mejorar la formación especializada en estas materias, tanto por parte de los empleados públicos como de la sociedad en general."]
[]
[null,{"$f":"TABLAS!$AL$2","v":"BASES PARA LA ELABORACIÓN DE UNA ESTRATEGIA DE REHABILITACIÓN DEL ENTORNO CONSTRUIDO"},{"$f":"IF(C$1=\"\",\"\",C$1)","v":"Error: sin asignar."},{"$f":"IF(D$1=\"\",\"\",D$1)","v":"Error: sin asignar."},"Error: sin asignar.","Error: sin asignar.","Error: sin asignar.","Error: sin asignar.","","","","","","","","","","","","","","","","","","","","","","","",""]
[null,{"$f":"IF($B$2=\"\",\"\",$B$2)","v":"ETAPA III: PROGRAMA DE ACTUACIONES"}]
[null,{"$f":"TABLAS!$AL$4","v":""}]
["LÍNEAS DE ACTUACIÓN",null,"ACCIONES"]
[10," MEJORAR LOS INSTRUMENTOS DE INTERVENCIÓN Y LA GOBERNANZA","A.1","A.2","A.3","A.4","A.5","A.6","A.7","A.8","A.9","A.10","A.11","A.12","A.13","A.14","A.15","A.16","A.17","A.18","A.19","A.20","A.21","A.22","A.23","A.24","A.25","A.26","A.27","A.28","A.29","A.30"]
["10.1","Lograr un marco normativo y de planeamiento actualizado, flexible y simplificado que mejore, también, la gestión."]
["10.1.1","Simplificar el marco normativo existente y garantizar su estabilidad. Para ello sería útil alcanzar, mediante un pacto global, unas bases comúnmente aceptadas en torno a los grandes objetivos estratégicos en materia de ordenación territorial y urbanismo que admitan adaptaciones menores y parciales."]
["10.1.2","Generar un marco normativo que promueva una integración adecuada de la tramitación ambiental y la de los planes urbanísticos o territoriales, propugnando una simultaneidad en los trámites."]
["10.1.3","Remitir a desarrollo reglamentario todo lo que pueda rigidizar en extremo la aplicación de la norma legal."]
["10.1.4","Desarrollar de manera efectiva la planificación de ordenación territorial a escala regional y sub-regional que aún falta en muchas Comunidades Autónomas, lo que posibilitará un acercamiento multinivel y multiescalar al territorio, a la ciudad y al resto de las poblaciones."]
["10.1.5","Mejorar el sistema tradicional de planeamiento urbanístico, dotando de mayor carácter estratégico a los Planes Generales y remitiendo la ordenación pormenorizada al planeamiento de desarrollo, que es más ágil y flexible en su modificación y revisión. "]
["10.1.6","Recuperar el papel de la planificación como instrumento para conseguir que las ciudades sean espacios de redistribución e inclusión."]
["10.1.7","Agilizar y unificar procedimientos de tramitación y aprobación de los instrumentos de planeamiento y flexibilizar y hacer más ágil la gestión urbanística (los planes y las licencias y autorizaciones deberían reducir sensiblemente sus plazos de tramitación y aprobación actuales)."]
["10.1.8","Garantizar una adecuada integración de los aspectos sectoriales en la planificación territorial y urbanística, incluso abordando los cambios legislativos necesarios. Para ello, se proponen como instrumentos adecuados las ventanillas únicas de tramitación de estos informes en cada nivel de Administración Pública y procedimientos y plazos breves de emisión, e iguales, para todos ellos. "]
["10.1.9","Elaborar guías o catálogos de los informes sectoriales que se requieren para poder tramitar y aprobar los instrumentos de planeamiento."]
["10.1.10","Garantizar en los instrumentos de planeamiento un tratamiento adaptado a los objetivos de la Agenda Urbana Española."]
["10.1.11","En la Administración local disponer de Ordenanzas municipales que sean compatibles con la normativa estatal y autonómica y que permitan aplicar ambas sin lagunas, ni problemas interpretativos."]
["10.1.12","Crear instrumentos adecuados para la intervención en las áreas consolidadas, mediante operaciones de rehabilitación, regeneración y renovación urbanas."]
["10.1.13","Propiciar que, en los municipios más pequeños, se fomente la autopromoción de vivienda como un instrumento para evitar la despoblación (v.g recuperando la previsión de las Normas Complementarias y Subsidiarias que establecían la construcción de edificios con PB+II."]
["10.2","Asegurar la particpación ciudadana, la transparencia y favorecer la gobernanza multinivel.","A1","A2","A3","A4","A5","A6","A7","A8","A9","A10","A11","A12","A13","A14","A15","A16","A17","A18","A19","A20","A21","A22","A23","A24","A25","A26","A27","A28","A29","A30"]
["10.2.1","Fomentar y favorecer la gobernanza multinivel entre el planeamiento territorial y el urbanístico, mediante la utilización de fórmulas supramunicipales o de coordinación y colaboración interadministrativa para superar las insuficiencias de los pequeños núcleos de población: diputaciones, cabildos, comarcas, asociaciones municipales con una finalidad específica, etc. La experiencia, incluso, de estructuras transfronterizas, como la que propone Agenda Urbana del Eixo Atlántico, juegan a favor de una buena gobernanza, como lo hacen también los planes supramunicipales vinculados con los planes de desarrollo rural sostenible (por ejemplo, los relativos a proyectos de reserva de la biosfera a nivel comarcal)."]
["10.2.2","Buscar el reequilibrio interno de las ciudades con una gestión adecuada del territorio y de las personas. Los distritos pueden ser un espacio físico adecuado para poner en marcha iniciativas integradas de reequilibrio territorial y social."]
["10.2.3","Fortalecer los mecanismos e instituciones jurídicas de colaboración público-privada y la coproducción de políticas públicas. "]
["10.2.4","Buscar la mayor eficacia y eficiencia de las Administraciones Públicas evitando las duplicidades entre ellas y las disfunciones."]
["10.2.5","Potenciar los instrumentos de colaboración horizontal junto a los de carácter sectorial como forma de conseguir una visión de conjunto que optimice el uso de los recursos, en todos los ámbitos de Administración Pública."]
["10.2.6","Garantizar un procedimiento participativo abierto a toda la ciudadanía que sea previo al procedimiento formal de elaboración de los instrumentos de ordenación territorial y urbanística como forma de asegurar una verdadera participación ciudadana. "]
["10.2.7","Fomentar la participación en el diseño, seguimiento y evaluación de políticas públicas por parte de las personas, las familias, los pueblos y las comunidades. La accesibilidad a la información es clave para lograr dicha participación."]
["10.2.8","Integrar la participación en el planeamiento de manera real y efectiva durante todo el proceso y más allá de los trámites obligatorios de información al público y alegaciones. Es preciso buscar la corresponsabilidad en la adopción de las decisiones, fomentar el trabajo en red y la permanente innovación social."]
["10.2.9","Impulsar los presupuestos participativos en los gobiernos locales. "]
["10.2.10","Fomentar la transparencia y los datos abiertos en la planificación y en la gestión de los asuntos públicos así como la rendición de cuentas de la actuación pública. "]
["10.2.11","Impulsar la creación de oficinas permanentes que faciliten información sobre la ciudad, su funcionamiento y su gestión, de forma que se genere un sentimiento de participación y de agente activo en la ciudad.Esta medida podría complementarse con el impulso de la figura de los “mediadores o “agentes” profesionales que, mediante la aportación de conocimientos específicos pueden facilitar dichas tareas."]
["10.2.12","Elaborar guías de funcionamiento de la ciudad accesibles a través de las nuevas tecnologías."]
["10.2.13","Elaborar mapas de información de la ciudad que permitan cruzar los datos de todos los servicios ofrecidos para que, a través de su análisis, se puedan introducir mejoras e identificar patrones."]
["10.2.14","Crear bases estadísticas municipales que permitan a las ciudades tener un mejor conocimiento de las dinámicas económicas locales."]
["10.3","Impulsar la capacitación local y mejorar la financiación.","A1","A2","A3","A4","A5","A6","A7","A8","A9","A10","A11","A12","A13","A14","A15","A16","A17","A18","A19","A20","A21","A22","A23","A24","A25","A26","A27","A28","A29","A30"]
["10.3.1","Garantizar el adecuado conocimiento de todos los programas y líneas de ayudas públicas (internacionales, nacionales, autonómicas y locales) existentes al servicio de los objetivos de la Agenda Urbana Española. Especialmente entre los técnicos municipales, a los que debería formarse en la gestión de estos programas para su mayor aprovechamiento."]
["10.3.2","Vincular la obtención de financiación pública al cumplimiento del marco estratégico previsto en la Agenda Urbana y a la elaboración del correspondiente Plan de acción que conlleve un diagnóstico previo considerando los objetivos estratégicos y los específicos."]
["10.3.3","Mejorar la financiación de las políticas y los servicios que necesariamente se deben prestar. "]
["10.3.4","Proponer que los municipios menores de 20.000 habitantes puedan tener acceso a las Estrategias de Desarrollo Urbano Sostenible (EDUSI), y de no ser así, tratar de conseguir este objetivo a nivel estrictamente del Estado español."]
["10.3.5","Abrir la convocatoria a conjuntos de municipios de distintas CC.AA. aunque deba mantenerse el umbral de los 20.000 habitantes."]
["10.3.6","Relacionar los presupuestos municipales con el cumplimiento de los objetivos de la Agenda."]
["10.3.7","Resolver los déficits de recursos técnicos y humanos de las Administraciones encargadas de implementar la Agenda 2030 y la Agenda Urbana."]
["10.3.8","Primar la consecución de resultados y la implantación de buenas prácticas como criterios objetivos para la distribución territorial de financiación."]
["10.3.9","Fomentar el mecenazgo como medio de financiación privada de iniciativas y proyectos para fines de interés general."]
["10.3.10","Fomentar la microfinanciación como medio de financiación colectiva de iniciativas y proyectos."]
["10.3.11","Fomentar e impulsar la investigación urbana y urbanística."]
["10.3.12","Fomentar los cursos y programas de formación relacionados con las temáticas nacionales e internacionales que engloban las agendas urbanas, para los técnicos responsables, en las Administraciones públicas, de llevar a cabo su implementación."]
["10.4","Diseñar y poner en marcha campañas de formación y sensibilización en materia urbana y el intercambio y difusión del conocimiento.","A1","A2","A3","A4","A5","A6","A7","A8","A9","A10","A11","A12","A13","A14","A15","A16","A17","A18","A19","A20","A21","A22","A23","A24","A25","A26","A27","A28","A29","A30"]
["10.4.1","Fomentar la educación, formación y la sensibilización ciudadana específicamente en materia de urbanismo, y de manera particular tratar de generar una cultura de la conservación, mantenimiento y rehabilitación del patrimonio edificado y construido (tanto el común, como el privado).  "]
["10.4.2","Crear estructuras estables de información con sedes físicas concretas que tengan entre sus fines educar en el funcionamiento de la ciudad y ayuden a generar una cultura de participación ciudadana y establecer canales adecuados y accesibles para que aquélla sea real y efectiva, teniendo en cuenta la diversidad humana que entrañan los fenómenos urbanos. "]
["10.4.3","Realizar labores didácticas que acerquen los instrumentos de ordenación territorial y urbanística a los ciudadanos, utilizando herramientas adecuadas que les permitan entender su trascendencia para la calidad de vida."]
["10.4.4","Elaborar materiales divulgativos específicos sobre el desarrollo urbano, las ciudades, su vinculación con los ODS y la urbanidad. "]
["10.4.5","Desarrollar cursos, talleres y debates de urbanismo. La colaboración con Universidades, Colegios profesionales y el sector privado, además de la propia colaboración interadministrativa puede ser un elemento muy útil y enriquecedor, porque solo desde la formación y la información se podrán tomar decisiones eficaces y no demagógicas."]
["10.4.6","Fomentar el diálogo civil, entendido como aquél que permite a las organizaciones y asociaciones representativas de intereses diversos (personas con discapacidad, familias, vecinos, etc.) participar en la elaboración, ejecución, seguimiento y evaluación de las políticas públicas que les afectan. Este objetivo incluiría el fomento de la propia creación y mantenimiento de estas asociaciones y organizaciones como verdaderos cauces de participación democrática en los asuntos públicos."]
["10.4.7","Fomentar las experiencias basadas en la transferencia de proyectos piloto exitosos en otros lugares. Se trataría de compartir la forma en la que se pueden abordar problemas comunes con soluciones de probada y contrastada utilidad, trabajando por medio de redes de ciudades, tanto nacionales como internacionales. El trabajo por medio de espacios digitales puede resultar muy útil a estos efectos."]

{"sheet":"ETAPA III.b","index":10,"n_rows":40,"n_cols":45,"rows_kept":40,"cut":false,"hidden":false,"merged":[[8,13,8,16],[8,17,8,20],[8,21,8,24],[7,1,7,4],[7,5,7,8],[7,9,7,12],[7,13,7,16],[7,17,7,20],[0,4,0,40],[6,0,9,0],[2,28,2,40],[6,1,6,40],[7,21,7,24],[7,25,7,28],[7,29,7,32],[7,33,7,36],[7,37,7,40],[8,25,8,28],[8,29,8,32],[8,33,8,36],[8,37,8,40],[8,1,8,4],[8,5,8,8],[8,9,8,12]]}
[null,null,null,null,{"$f":"TABLAS!$AL$2","v":"BASES PARA LA ELABORACIÓN DE UNA ESTRATEGIA DE REHABILITACIÓN DEL ENTORNO CONSTRUIDO"},null,null,null,null,null,null,null,null,null,null,null,null,null,null,null,null,null,null,null,null,null,null,null,null,null,null,null,null,null,null,null,null,null,null,null,null,null,"OCULTAR","OCULTAR","OCULTAR"]
[null,null,null,null,null,null,null,null,null,null,null,null,null,null,null,null,null,null,null,null,null,null,null,null,null,null,null,null,null,null,null,null,null,null,null,null,null,null,null,null,{"$f":"TABLAS!$AL$6","v":"ETAPA III: PROGRAMA DE ACTUACIONES"}]
[null,null,null,null,null,null,null,null,null,null,null,null,null,null,null,null,null,null,null,null,null,null,null,null,null,null,null,null,{"$f":"TABLAS!$AL$4","v":""}]
[]
["  III.b  Diagrama de Gantt"]
[]
["Acciones","Presupuesto y calendario de las acciones",null,null,null,null,null,null,null,null,null,null,null,null,null,null,null,null,null,null,null,null,null,null,null,null,null,null,null,null,null,null,null,null,null,null,null,null,null,null,null,"TOTAL"]
[null,{"$f":"SUM(INDIRECT(CONCATENATE(SUBSTITUTE(ADDRESS(1,COLUMN()),1,\"\"),\"11:\",SUBSTITUTE(ADDRESS(1,COLUMN()+3),1,\"\"),10+'ETAPA III.a'!$I$4)))","v":{"$error":"#N/A"}},null,null,null,{"$f":"SUM(INDIRECT(CONCATENATE(SUBSTITUTE(ADDRESS(1,COLUMN()),1,\"\"),\"11:\",SUBSTITUTE(ADDRESS(1,COLUMN()+3),1,\"\"),10+'ETAPA III.a'!$I$4)))","v":{"$error":"#N/A"}},null,null,null,{"$f":"SUM(INDIRECT(CONCATENATE(SUBSTITUTE(ADDRESS(1,COLUMN()),1,\"\"),\"11:\",SUBSTITUTE(ADDRESS(1,COLUMN()+3),1,\"\"),10+'ETAPA III.a'!$I$4)))","v":{"$error":"#N/A"}},null,null,null,{"$f":"SUM(INDIRECT(CONCATENATE(SUBSTITUTE(ADDRESS(1,COLUMN()),1,\"\"),\"11:\",SUBSTITUTE(ADDRESS(1,COLUMN()+3),1,\"\"),10+'ETAPA III.a'!$I$4)))","v":{"$error":"#N/A"}},null,null,null,{"$f":"SUM(INDIRECT(CONCATENATE(SUBSTITUTE(ADDRESS(1,COLUMN()),1,\"\"),\"11:\",SUBSTITUTE(ADDRESS(1,COLUMN()+3),1,\"\"),10+'ETAPA III.a'!$I$4)))","v":{"$error":"#N/A"}},null,null,null,{"$f":"SUM(INDIRECT(CONCATENATE(SUBSTITUTE(ADDRESS(1,COLUMN()),1,\"\"),\"11:\",SUBSTITUTE(ADDRESS(1,COLUMN()+3),1,\"\"),10+'ETAPA III.a'!$I$4)))","v":{"$error":"#N/A"}},null,null,null,{"$f":"SUM(INDIRECT(CONCATENATE(SUBSTITUTE(ADDRESS(1,COLUMN()),1,\"\"),\"11:\",SUBSTITUTE(ADDRESS(1,COLUMN()+3),1,\"\"),10+'ETAPA III.a'!$I$4)))","v":{"$error":"#N/A"}},null,null,null,{"$f":"SUM(INDIRECT(CONCATENATE(SUBSTITUTE(ADDRESS(1,COLUMN()),1,\"\"),\"11:\",SUBSTITUTE(ADDRESS(1,COLUMN()+3),1,\"\"),10+'ETAPA III.a'!$I$4)))","v":{"$error":"#N/A"}},null,null,null,{"$f":"SUM(INDIRECT(CONCATENATE(SUBSTITUTE(ADDRESS(1,COLUMN()),1,\"\"),\"11:\",SUBSTITUTE(ADDRESS(1,COLUMN()+3),1,\"\"),10+'ETAPA III.a'!$I$4)))","v":{"$error":"#N/A"}},null,null,null,{"$f":"SUM(INDIRECT(CONCATENATE(SUBSTITUTE(ADDRESS(1,COLUMN()),1,\"\"),\"11:\",SUBSTITUTE(ADDRESS(1,COLUMN()+3),1,\"\"),10+'ETAPA III.a'!$I$4)))","v":{"$error":"#N/A"}},null,null,null,{"$f":"SUM(B8:AO8)","v":{"$error":"#N/A"}}]
[null,2021,null,null,null,2022,null,null,null,2023,null,null,null,2024,null,null,null,2025,null,null,null,2026,null,null,null,2027,null,null,null,2028,null,null,null,2029,null,null,null,2030]
[null,"T1","T2","T3","T4","T1","T2","T3","T4","T1","T2","T3","T4","T1","T2","T3","T4","T1","T2","T3","T4","T1","T2","T3","T4","T1","T2","T3","T4","T1","T2","T3","T4","T1","T2","T3","T4","T1","T2","T3","T4"]
[1,{"$f":"IF(COLUMN()>=INDIRECT(AQ11),IF(COLUMN()<=INDIRECT(AR11),INDIRECT(AS11),\"\"),\"\")","v":{"$error":"#N/A"}},{"$f":"IF(COLUMN()>=INDIRECT(AQ11),IF(COLUMN()<=INDIRECT(AR11),INDIRECT(AS11),\"\"),\"\")","v":{"$error":"#N/A"}},{"$f":"IF(COLUMN()>=INDIRECT(AQ11),IF(COLUMN()<=INDIRECT(AR11),INDIRECT(AS11),\"\"),\"\")","v":{"$error":"#N/A"}},{"$f":"IF(COLUMN()>=INDIRECT(AQ11),IF(COLUMN()<=INDIRECT(AR11),INDIRECT(AS11),\"\"),\"\")","v":{"$error":"#N/A"}},{"$f":"IF(COLUMN()>=INDIRECT(AQ11),IF(COLUMN()<=INDIRECT(AR11),INDIRECT(AS11),\"\"),\"\")","v":{"$error":"#N/A"}},{"$f":"IF(COLUMN()>=INDIRECT(AQ11),IF(COLUMN()<=INDIRECT(AR11),INDIRECT(AS11),\"\"),\"\")","v":{"$error":"#N/A"}},{"$f":"IF(COLUMN()>=INDIRECT(AQ11),IF(COLUMN()<=INDIRECT(AR11),INDIRECT(AS11),\"\"),\"\")","v":{"$error":"#N/A"}},{"$f":"IF(COLUMN()>=INDIRECT(AQ11),IF(COLUMN()<=INDIRECT(AR11),INDIRECT(AS11),\"\"),\"\")","v":{"$error":"#N/A"}},{"$f":"IF(COLUMN()>=INDIRECT(AQ11),IF(COLUMN()<=INDIRECT(AR11),INDIRECT(AS11),\"\"),\"\")","v":{"$error":"#N/A"}},{"$f":"IF(COLUMN()>=INDIRECT(AQ11),IF(COLUMN()<=INDIRECT(AR11),INDIRECT(AS11),\"\"),\"\")","v":{"$error":"#N/A"}},{"$f":"IF(COLUMN()>=INDIRECT(AQ11),IF(COLUMN()<=INDIRECT(AR11),INDIRECT(AS11),\"\"),\"\")","v":{"$error":"#N/A"}},{"$f":"IF(COLUMN()>=INDIRECT(AQ11),IF(COLUMN()<=INDIRECT(AR11),INDIRECT(AS11),\"\"),\"\")","v":{"$error":"#N/A"}},{"$f":"IF(COLUMN()>=INDIRECT(AQ11),IF(COLUMN()<=INDIRECT(AR11),INDIRECT(AS11),\"\"),\"\")","v":{"$error":"#N/A"}},{"$f":"IF(COLUMN()>=INDIRECT(AQ11),IF(COLUMN()<=INDIRECT(AR11),INDIRECT(AS11),\"\"),\"\")","v":{"$error":"#N/A"}},{"$f":"IF(COLUMN()>=INDIRECT(AQ11),IF(COLUMN()<=INDIRECT(AR11),INDIRECT(AS11),\"\"),\"\")","v":{"$error":"#N/A"}},{"$f":"IF(COLUMN()>=INDIRECT(AQ11),IF(COLUMN()<=INDIRECT(AR11),INDIRECT(AS11),\"\"),\"\")","v":{"$error":"#N/A"}},{"$f":"IF(COLUMN()>=INDIRECT(AQ11),IF(COLUMN()<=INDIRECT(AR11),INDIRECT(AS11),\"\"),\"\")","v":{"$error":"#N/A"}},{"$f":"IF(COLUMN()>=INDIRECT(AQ11),IF(COLUMN()<=INDIRECT(AR11),INDIRECT(AS11),\"\"),\"\")","v":{"$error":"#N/A"}},{"$f":"IF(COLUMN()>=INDIRECT(AQ11),IF(COLUMN()<=INDIRECT(AR11),INDIRECT(AS11),\"\"),\"\")","v":{"$error":"#N/A"}},{"$f":"IF(COLUMN()>=INDIRECT(AQ11),IF(COLUMN()<=INDIRECT(AR11),INDIRECT(AS11),\"\"),\"\")","v":{"$error":"#N/A"}},{"$f":"IF(COLUMN()>=INDIRECT(AQ11),IF(COLUMN()<=INDIRECT(AR11),INDIRECT(AS11),\"\"),\"\")","v":{"$error":"#N/A"}},{"$f":"IF(COLUMN()>=INDIRECT(AQ11),IF(COLUMN()<=INDIRECT(AR11),INDIRECT(AS11),\"\"),\"\")","v":{"$error":"#N/A"}},{"$f":"IF(COLUMN()>=INDIRECT(AQ11),IF(COLUMN()<=INDIRECT(AR11),INDIRECT(AS11),\"\"),\"\")","v":{"$error":"#N/A"}},{"$f":"IF(COLUMN()>=INDIRECT(AQ11),IF(COLUMN()<=INDIRECT(AR11),INDIRECT(AS11),\"\"),\"\")","v":{"$error":"#N/A"}},{"$f":"IF(COLUMN()>=INDIRECT(AQ11),IF(COLUMN()<=INDIRECT(AR11),INDIRECT(AS11),\"\"),\"\")","v":{"$error":"#N/A"}},{"$f":"IF(COLUMN()>=INDIRECT(AQ11),IF(COLUMN()<=INDIRECT(AR11),INDIRECT(AS11),\"\"),\"\")","v":{"$error":"#N/A"}},{"$f":"IF(COLUMN()>=INDIRECT(AQ11),IF(COLUMN()<=INDIRECT(AR11),INDIRECT(AS11),\"\"),\"\")","v":{"$error":"#N/A"}},{"$f":"IF(COLUMN()>=INDIRECT(AQ11),IF(COLUMN()<=INDIRECT(AR11),INDIRECT(AS11),\"\"),\"\")","v":{"$error":"#N/A"}},{"$f":"IF(COLUMN()>=INDIRECT(AQ11),IF(COLUMN()<=INDIRECT(AR11),INDIRECT(AS11),\"\"),\"\")","v":{"$error":"#N/A"}},{"$f":"IF(COLUMN()>=INDIRECT(AQ11),IF(COLUMN()<=INDIRECT(AR11),INDIRECT(AS11),\"\"),\"\")","v":{"$error":"#N/A"}},{"$f":"IF(COLUMN()>=INDIRECT(AQ11),IF(COLUMN()<=INDIRECT(AR11),INDIRECT(AS11),\"\"),\"\")","v":{"$error":"#N/A"}},{"$f":"IF(COLUMN()>=INDIRECT(AQ11),IF(COLUMN()<=INDIRECT(AR11),INDIRECT(AS11),\"\"),\"\")","v":{"$error":"#N/A"}},{"$f":"IF(COLUMN()>=INDIRECT(AQ11),IF(COLUMN()<=INDIRECT(AR11),INDIRECT(AS11),\"\"),\"\")","v":{"$error":"#N/A"}},{"$f":"IF(COLUMN()>=INDIRECT(AQ11),IF(COLUMN()<=INDIRECT(AR11),INDIRECT(AS11),\"\"),\"\")","v":{"$error":"#N/A"}},{"$f":"IF(COLUMN()>=INDIRECT(AQ11),IF(COLUMN()<=INDIRECT(AR11),INDIRECT(AS11),\"\"),\"\")","v":{"$error":"#N/A"}},{"$f":"IF(COLUMN()>=INDIRECT(AQ11),IF(COLUMN()<=INDIRECT(AR11),INDIRECT(AS11),\"\"),\"\")","v":{"$error":"#N/A"}},{"$f":"IF(COLUMN()>=INDIRECT(AQ11),IF(COLUMN()<=INDIRECT(AR11),INDIRECT(AS11),\"\"),\"\")","v":{"$error":"#N/A"}},{"$f":"IF(COLUMN()>=INDIRECT(AQ11),IF(COLUMN()<=INDIRECT(AR11),INDIRECT(AS11),\"\"),\"\")","v":{"$error":"#N/A"}},{"$f":"IF(COLUMN()>=INDIRECT(AQ11),IF(COLUMN()<=INDIRECT(AR11),INDIRECT(AS11),\"\"),\"\")","v":{"$error":"#N/A"}},{"$f":"IF(COLUMN()>=INDIRECT(AQ11),IF(COLUMN()<=INDIRECT(AR11),INDIRECT(AS11),\"\"),\"\")","v":{"$error":"#N/A"}},null,{"$f":"CONCATENATE(\"'\",SUBSTITUTE(SUBSTITUTE(SUBSTITUTE(MID(CELL(\"direccion\",'ETAPA III.a'!M$1),FIND(\"]\",CELL(\"direccion\",'ETAPA III.a'!M$1))+1,LEN(CELL(\"direccion\",'ETAPA III.a'!M$1))),\"$\",\"\"),1,MATCH($A11,'ETAPA III.a'!$K:$K,0)),\"!\",\"!$\"))","v":"'ETAPA III.a'!$M6"},{"$f":"CONCATENATE(\"'\",SUBSTITUTE(SUBSTITUTE(SUBSTITUTE(MID(CELL(\"direccion\",'ETAPA III.a'!N$1),FIND(\"]\",CELL(\"direccion\",'ETAPA III.a'!N$1))+1,LEN(CELL(\"direccion\",'ETAPA III.a'!N$1))),\"$\",\"\"),1,MATCH($A11,'ETAPA III.a'!$K:$K,0)),\"!\",\"!$\"))","v":"'ETAPA III.a'!$N6"},{"$f":"CONCATENATE(\"'\",SUBSTITUTE(SUBSTITUTE(SUBSTITUTE(MID(CELL(\"direccion\",'ETAPA III.a'!L$1),FIND(\"]\",CELL(\"direccion\",'ETAPA III.a'!L$1))+1,LEN(CELL(\"direccion\",'ETAPA III.a'!L$1))),\"$\",\"\"),1,MATCH($A11,'ETAPA III.a'!$K:$K,0)),\"!\",\"!$\"))","v":"'ETAPA III.a'!$L6"}]
[2,{"$f":"IF(COLUMN()>=INDIRECT(AQ12),IF(COLUMN()<=INDIRECT(AR12),INDIRECT(AS12),\"\"),\"\")","v":{"$error":"#N/A"}},{"$f":"IF(COLUMN()>=INDIRECT(AQ12),IF(COLUMN()<=INDIRECT(AR12),INDIRECT(AS12),\"\"),\"\")","v":{"$error":"#N/A"}},{"$f":"IF(COLUMN()>=INDIRECT(AQ12),IF(COLUMN()<=INDIRECT(AR12),INDIRECT(AS12),\"\"),\"\")","v":{"$error":"#N/A"}},{"$f":"IF(COLUMN()>=INDIRECT(AQ12),IF(COLUMN()<=INDIRECT(AR12),INDIRECT(AS12),\"\"),\"\")","v":{"$error":"#N/A"}},{"$f":"IF(COLUMN()>=INDIRECT(AQ12),IF(COLUMN()<=INDIRECT(AR12),INDIRECT(AS12),\"\"),\"\")","v":{"$error":"#N/A"}},{"$f":"IF(COLUMN()>=INDIRECT(AQ12),IF(COLUMN()<=INDIRECT(AR12),INDIRECT(AS12),\"\"),\"\")","v":{"$error":"#N/A"}},{"$f":"IF(COLUMN()>=INDIRECT(AQ12),IF(COLUMN()<=INDIRECT(AR12),INDIRECT(AS12),\"\"),\"\")","v":{"$error":"#N/A"}},{"$f":"IF(COLUMN()>=INDIRECT(AQ12),IF(COLUMN()<=INDIRECT(AR12),INDIRECT(AS12),\"\"),\"\")","v":{"$error":"#N/A"}},{"$f":"IF(COLUMN()>=INDIRECT(AQ12),IF(COLUMN()<=INDIRECT(AR12),INDIRECT(AS12),\"\"),\"\")","v":{"$error":"#N/A"}},{"$f":"IF(COLUMN()>=INDIRECT(AQ12),IF(COLUMN()<=INDIRECT(AR12),INDIRECT(AS12),\"\"),\"\")","v":{"$error":"#N/A"}},{"$f":"IF(COLUMN()>=INDIRECT(AQ12),IF(COLUMN()<=INDIRECT(AR12),INDIRECT(AS12),\"\"),\"\")","v":{"$error":"#N/A"}},{"$f":"IF(COLUMN()>=INDIRECT(AQ12),IF(COLUMN()<=INDIRECT(AR12),INDIRECT(AS12),\"\"),\"\")","v":{"$error":"#N/A"}},{"$f":"IF(COLUMN()>=INDIRECT(AQ12),IF(COLUMN()<=INDIRECT(AR12),INDIRECT(AS12),\"\"),\"\")","v":{"$error":"#N/A"}},{"$f":"IF(COLUMN()>=INDIRECT(AQ12),IF(COLUMN()<=INDIRECT(AR12),INDIRECT(AS12),\"\"),\"\")","v":{"$error":"#N/A"}},{"$f":"IF(COLUMN()>=INDIRECT(AQ12),IF(COLUMN()<=INDIRECT(AR12),INDIRECT(AS12),\"\"),\"\")","v":{"$error":"#N/A"}},{"$f":"IF(COLUMN()>=INDIRECT(AQ12),IF(COLUMN()<=INDIRECT(AR12),INDIRECT(AS12),\"\"),\"\")","v":{"$error":"#N/A"}},{"$f":"IF(COLUMN()>=INDIRECT(AQ12),IF(COLUMN()<=INDIRECT(AR12),INDIRECT(AS12),\"\"),\"\")","v":{"$error":"#N/A"}},{"$f":"IF(COLUMN()>=INDIRECT(AQ12),IF(COLUMN()<=INDIRECT(AR12),INDIRECT(AS12),\"\"),\"\")","v":{"$error":"#N/A"}},{"$f":"IF(COLUMN()>=INDIRECT(AQ12),IF(COLUMN()<=INDIRECT(AR12),INDIRECT(AS12),\"\"),\"\")","v":{"$error":"#N/A"}},{"$f":"IF(COLUMN()>=INDIRECT(AQ12),IF(COLUMN()<=INDIRECT(AR12),INDIRECT(AS12),\"\"),\"\")","v":{"$error":"#N/A"}},{"$f":"IF(COLUMN()>=INDIRECT(AQ12),IF(COLUMN()<=INDIRECT(AR12),INDIRECT(AS12),\"\"),\"\")","v":{"$error":"#N/A"}},{"$f":"IF(COLUMN()>=INDIRECT(AQ12),IF(COLUMN()<=INDIRECT(AR12),INDIRECT(AS12),\"\"),\"\")","v":{"$error":"#N/A"}},{"$f":"IF(COLUMN()>=INDIRECT(AQ12),IF(COLUMN()<=INDIRECT(AR12),INDIRECT(AS12),\"\"),\"\")","v":{"$error":"#N/A"}},{"$f":"IF(COLUMN()>=INDIRECT(AQ12),IF(COLUMN()<=INDIRECT(AR12),INDIRECT(AS12),\"\"),\"\")","v":{"$error":"#N/A"}},{"$f":"IF(COLUMN()>=INDIRECT(AQ12),IF(COLUMN()<=INDIRECT(AR12),INDIRECT(AS12),\"\"),\"\")","v":{"$error":"#N/A"}},{"$f":"IF(COLUMN()>=INDIRECT(AQ12),IF(COLUMN()<=INDIRECT(AR12),INDIRECT(AS12),\"\"),\"\")","v":{"$error":"#N/A"}},{"$f":"IF(COLUMN()>=INDIRECT(AQ12),IF(COLUMN()<=INDIRECT(AR12),INDIRECT(AS12),\"\"),\"\")","v":{"$error":"#N/A"}},{"$f":"IF(COLUMN()>=INDIRECT(AQ12),IF(COLUMN()<=INDIRECT(AR12),INDIRECT(AS12),\"\"),\"\")","v":{"$error":"#N/A"}},{"$f":"IF(COLUMN()>=INDIRECT(AQ12),IF(COLUMN()<=INDIRECT(AR12),INDIRECT(AS12),\"\"),\"\")","v":{"$error":"#N/A"}},{"$f":"IF(COLUMN()>=INDIRECT(AQ12),IF(COLUMN()<=INDIRECT(AR12),INDIRECT(AS12),\"\"),\"\")","v":{"$error":"#N/A"}},{"$f":"IF(COLUMN()>=INDIRECT(AQ12),IF(COLUMN()<=INDIRECT(AR12),INDIRECT(AS12),\"\"),\"\")","v":{"$error":"#N/A"}},{"$f":"IF(COLUMN()>=INDIRECT(AQ12),IF(COLUMN()<=INDIRECT(AR12),INDIRECT(AS12),\"\"),\"\")","v":{"$error":"#N/A"}},{"$f":"IF(COLUMN()>=INDIRECT(AQ12),IF(COLUMN()<=INDIRECT(AR12),INDIRECT(AS12),\"\"),\"\")","v":{"$error":"#N/A"}},{"$f":"IF(COLUMN()>=INDIRECT(AQ12),IF(COLUMN()<=INDIRECT(AR12),INDIRECT(AS12),\"\"),\"\")","v":{"$error":"#N/A"}},{"$f":"IF(COLUMN()>=INDIRECT(AQ12),IF(COLUMN()<=INDIRECT(AR12),INDIRECT(AS12),\"\"),\"\")","v":{"$error":"#N/A"}},{"$f":"IF(COLUMN()>=INDIRECT(AQ12),IF(COLUMN()<=INDIRECT(AR12),INDIRECT(AS12),\"\"),\"\")","v":{"$error":"#N/A"}},{"$f":"IF(COLUMN()>=INDIRECT(AQ12),IF(COLUMN()<=INDIRECT(AR12),INDIRECT(AS12),\"\"),\"\")","v":{"$error":"#N/A"}},{"$f":"IF(COLUMN()>=INDIRECT(AQ12),IF(COLUMN()<=INDIRECT(AR12),INDIRECT(AS12),\"\"),\"\")","v":{"$error":"#N/A"}},{"$f":"IF(COLUMN()>=INDIRECT(AQ12),IF(COLUMN()<=INDIRECT(AR12),INDIRECT(AS12),\"\"),\"\")","v":{"$error":"#N/A"}},{"$f":"IF(COLUMN()>=INDIRECT(AQ12),IF(COLUMN()<=INDIRECT(AR12),INDIRECT(AS12),\"\"),\"\")","v":{"$error":"#N/A"}},null,{"$f":"CONCATENATE(\"'\",SUBSTITUTE(SUBSTITUTE(SUBSTITUTE(MID(CELL(\"direccion\",'ETAPA III.a'!M$1),FIND(\"]\",CELL(\"direccion\",'ETAPA III.a'!M$1))+1,LEN(CELL(\"direccion\",'ETAPA III.a'!M$1))),\"$\",\"\"),1,MATCH($A12,'ETAPA III.a'!$K:$K,0)),\"!\",\"!$\"))","v":"'ETAPA III.a'!$M13"},{"$f":"CONCATENATE(\"'\",SUBSTITUTE(SUBSTITUTE(SUBSTITUTE(MID(CELL(\"direccion\",'ETAPA III.a'!N$1),FIND(\"]\",CELL(\"direccion\",'ETAPA III.a'!N$1))+1,LEN(CELL(\"direccion\",'ETAPA III.a'!N$1))),\"$\",\"\"),1,MATCH($A12,'ETAPA III.a'!$K:$K,0)),\"!\",\"!$\"))","v":"'ETAPA III.a'!$N13"},{"$f":"CONCATENATE(\"'\",SUBSTITUTE(SUBSTITUTE(SUBSTITUTE(MID(CELL(\"direccion\",'ETAPA III.a'!L$1),FIND(\"]\",CELL(\"direccion\",'ETAPA III.a'!L$1))+1,LEN(CELL(\"direccion\",'ETAPA III.a'!L$1))),\"$\",\"\"),1,MATCH($A12,'ETAPA III.a'!$K:$K,0)),\"!\",\"!$\"))","v":"'ETAPA III.a'!$L13"}]
[3,{"$f":"IF(COLUMN()>=INDIRECT(AQ13),IF(COLUMN()<=INDIRECT(AR13),INDIRECT(AS13),\"\"),\"\")","v":{"$error":"#N/A"}},{"$f":"IF(COLUMN()>=INDIRECT(AQ13),IF(COLUMN()<=INDIRECT(AR13),INDIRECT(AS13),\"\"),\"\")","v":{"$error":"#N/A"}},{"$f":"IF(COLUMN()>=INDIRECT(AQ13),IF(COLUMN()<=INDIRECT(AR13),INDIRECT(AS13),\"\"),\"\")","v":{"$error":"#N/A"}},{"$f":"IF(COLUMN()>=INDIRECT(AQ13),IF(COLUMN()<=INDIRECT(AR13),INDIRECT(AS13),\"\"),\"\")","v":{"$error":"#N/A"}},{"$f":"IF(COLUMN()>=INDIRECT(AQ13),IF(COLUMN()<=INDIRECT(AR13),INDIRECT(AS13),\"\"),\"\")","v":{"$error":"#N/A"}},{"$f":"IF(COLUMN()>=INDIRECT(AQ13),IF(COLUMN()<=INDIRECT(AR13),INDIRECT(AS13),\"\"),\"\")","v":{"$error":"#N/A"}},{"$f":"IF(COLUMN()>=INDIRECT(AQ13),IF(COLUMN()<=INDIRECT(AR13),INDIRECT(AS13),\"\"),\"\")","v":{"$error":"#N/A"}},{"$f":"IF(COLUMN()>=INDIRECT(AQ13),IF(COLUMN()<=INDIRECT(AR13),INDIRECT(AS13),\"\"),\"\")","v":{"$error":"#N/A"}},{"$f":"IF(COLUMN()>=INDIRECT(AQ13),IF(COLUMN()<=INDIRECT(AR13),INDIRECT(AS13),\"\"),\"\")","v":{"$error":"#N/A"}},{"$f":"IF(COLUMN()>=INDIRECT(AQ13),IF(COLUMN()<=INDIRECT(AR13),INDIRECT(AS13),\"\"),\"\")","v":{"$error":"#N/A"}},{"$f":"IF(COLUMN()>=INDIRECT(AQ13),IF(COLUMN()<=INDIRECT(AR13),INDIRECT(AS13),\"\"),\"\")","v":{"$error":"#N/A"}},{"$f":"IF(COLUMN()>=INDIRECT(AQ13),IF(COLUMN()<=INDIRECT(AR13),INDIRECT(AS13),\"\"),\"\")","v":{"$error":"#N/A"}},{"$f":"IF(COLUMN()>=INDIRECT(AQ13),IF(COLUMN()<=INDIRECT(AR13),INDIRECT(AS13),\"\"),\"\")","v":{"$error":"#N/A"}},{"$f":"IF(COLUMN()>=INDIRECT(AQ13),IF(COLUMN()<=INDIRECT(AR13),INDIRECT(AS13),\"\"),\"\")","v":{"$error":"#N/A"}},{"$f":"IF(COLUMN()>=INDIRECT(AQ13),IF(COLUMN()<=INDIRECT(AR13),INDIRECT(AS13),\"\"),\"\")","v":{"$error":"#N/A"}},{"$f":"IF(COLUMN()>=INDIRECT(AQ13),IF(COLUMN()<=INDIRECT(AR13),INDIRECT(AS13),\"\"),\"\")","v":{"$error":"#N/A"}},{"$f":"IF(COLUMN()>=INDIRECT(AQ13),IF(COLUMN()<=INDIRECT(AR13),INDIRECT(AS13),\"\"),\"\")","v":{"$error":"#N/A"}},{"$f":"IF(COLUMN()>=INDIRECT(AQ13),IF(COLUMN()<=INDIRECT(AR13),INDIRECT(AS13),\"\"),\"\")","v":{"$error":"#N/A"}},{"$f":"IF(COLUMN()>=INDIRECT(AQ13),IF(COLUMN()<=INDIRECT(AR13),INDIRECT(AS13),\"\"),\"\")","v":{"$error":"#N/A"}},{"$f":"IF(COLUMN()>=INDIRECT(AQ13),IF(COLUMN()<=INDIRECT(AR13),INDIRECT(AS13),\"\"),\"\")","v":{"$error":"#N/A"}},{"$f":"IF(COLUMN()>=INDIRECT(AQ13),IF(COLUMN()<=INDIRECT(AR13),INDIRECT(AS13),\"\"),\"\")","v":{"$error":"#N/A"}},{"$f":"IF(COLUMN()>=INDIRECT(AQ13),IF(COLUMN()<=INDIRECT(AR13),INDIRECT(AS13),\"\"),\"\")","v":{"$error":"#N/A"}},{"$f":"IF(COLUMN()>=INDIRECT(AQ13),IF(COLUMN()<=INDIRECT(AR13),INDIRECT(AS13),\"\"),\"\")","v":{"$error":"#N/A"}},{"$f":"IF(COLUMN()>=INDIRECT(AQ13),IF(COLUMN()<=INDIRECT(AR13),INDIRECT(AS13),\"\"),\"\")","v":{"$error":"#N/A"}},{"$f":"IF(COLUMN()>=INDIRECT(AQ13),IF(COLUMN()<=INDIRECT(AR13),INDIRECT(AS13),\"\"),\"\")","v":{"$error":"#N/A"}},{"$f":"IF(COLUMN()>=INDIRECT(AQ13),IF(COLUMN()<=INDIRECT(AR13),INDIRECT(AS13),\"\"),\"\")","v":{"$error":"#N/A"}},{"$f":"IF(COLUMN()>=INDIRECT(AQ13),IF(COLUMN()<=INDIRECT(AR13),INDIRECT(AS13),\"\"),\"\")","v":{"$error":"#N/A"}},{"$f":"IF(COLUMN()>=INDIRECT(AQ13),IF(COLUMN()<=INDIRECT(AR13),INDIRECT(AS13),\"\"),\"\")","v":{"$error":"#N/A"}},{"$f":"IF(COLUMN()>=INDIRECT(AQ13),IF(COLUMN()<=INDIRECT(AR13),INDIRECT(AS13),\"\"),\"\")","v":{"$error":"#N/A"}},{"$f":"IF(COLUMN()>=INDIRECT(AQ13),IF(COLUMN()<=INDIRECT(AR13),INDIRECT(AS13),\"\"),\"\")","v":{"$error":"#N/A"}},{"$f":"IF(COLUMN()>=INDIRECT(AQ13),IF(COLUMN()<=INDIRECT(AR13),INDIRECT(AS13),\"\"),\"\")","v":{"$error":"#N/A"}},{"$f":"IF(COLUMN()>=INDIRECT(AQ13),IF(COLUMN()<=INDIRECT(AR13),INDIRECT(AS13),\"\"),\"\")","v":{"$error":"#N/A"}},{"$f":"IF(COLUMN()>=INDIRECT(AQ13),IF(COLUMN()<=INDIRECT(AR13),INDIRECT(AS13),\"\"),\"\")","v":{"$error":"#N/A"}},{"$f":"IF(COLUMN()>=INDIRECT(AQ13),IF(COLUMN()<=INDIRECT(AR13),INDIRECT(AS13),\"\"),\"\")","v":{"$error":"#N/A"}},{"$f":"IF(COLUMN()>=INDIRECT(AQ13),IF(COLUMN()<=INDIRECT(AR13),INDIRECT(AS13),\"\"),\"\")","v":{"$error":"#N/A"}},{"$f":"IF(COLUMN()>=INDIRECT(AQ13),IF(COLUMN()<=INDIRECT(AR13),INDIRECT(AS13),\"\"),\"\")","v":{"$error":"#N/A"}},{"$f":"IF(COLUMN()>=INDIRECT(AQ13),IF(COLUMN()<=INDIRECT(AR13),INDIRECT(AS13),\"\"),\"\")","v":{"$error":"#N/A"}},{"$f":"IF(COLUMN()>=INDIRECT(AQ13),IF(COLUMN()<=INDIRECT(AR13),INDIRECT(AS13),\"\"),\"\")","v":{"$error":"#N/A"}},{"$f":"IF(COLUMN()>=INDIRECT(AQ13),IF(COLUMN()<=INDIRECT(AR13),INDIRECT(AS13),\"\"),\"\")","v":{"$error":"#N/A"}},{"$f":"IF(COLUMN()>=INDIRECT(AQ13),IF(COLUMN()<=INDIRECT(AR13),INDIRECT(AS13),\"\"),\"\")","v":{"$error":"#N/A"}},null,{"$f":"CONCATENATE(\"'\",SUBSTITUTE(SUBSTITUTE(SUBSTITUTE(MID(CELL(\"direccion\",'ETAPA III.a'!M$1),FIND(\"]\",CELL(\"direccion\",'ETAPA III.a'!M$1))+1,LEN(CELL(\"direccion\",'ETAPA III.a'!M$1))),\"$\",\"\"),1,MATCH($A13,'ETAPA III.a'!$K:$K,0)),\"!\",\"!$\"))","v":"'ETAPA III.a'!$M20"},{"$f":"CONCATENATE(\"'\",SUBSTITUTE(SUBSTITUTE(SUBSTITUTE(MID(CELL(\"direccion\",'ETAPA III.a'!N$1),FIND(\"]\",CELL(\"direccion\",'ETAPA III.a'!N$1))+1,LEN(CELL(\"direccion\",'ETAPA III.a'!N$1))),\"$\",\"\"),1,MATCH($A13,'ETAPA III.a'!$K:$K,0)),\"!\",\"!$\"))","v":"'ETAPA III.a'!$N20"},{"$f":"CONCATENATE(\"'\",SUBSTITUTE(SUBSTITUTE(SUBSTITUTE(MID(CELL(\"direccion\",'ETAPA III.a'!L$1),FIND(\"]\",CELL(\"direccion\",'ETAPA III.a'!L$1))+1,LEN(CELL(\"direccion\",'ETAPA III.a'!L$1))),\"$\",\"\"),1,MATCH($A13,'ETAPA III.a'!$K:$K,0)),\"!\",\"!$\"))","v":"'ETAPA III.a'!$L20"}]
[4,{"$f":"IF(COLUMN()>=INDIRECT(AQ14),IF(COLUMN()<=INDIRECT(AR14),INDIRECT(AS14),\"\"),\"\")","v":{"$error":"#N/A"}},{"$f":"IF(COLUMN()>=INDIRECT(AQ14),IF(COLUMN()<=INDIRECT(AR14),INDIRECT(AS14),\"\"),\"\")","v":{"$error":"#N/A"}},{"$f":"IF(COLUMN()>=INDIRECT(AQ14),IF(COLUMN()<=INDIRECT(AR14),INDIRECT(AS14),\"\"),\"\")","v":{"$error":"#N/A"}},{"$f":"IF(COLUMN()>=INDIRECT(AQ14),IF(COLUMN()<=INDIRECT(AR14),INDIRECT(AS14),\"\"),\"\")","v":{"$error":"#N/A"}},{"$f":"IF(COLUMN()>=INDIRECT(AQ14),IF(COLUMN()<=INDIRECT(AR14),INDIRECT(AS14),\"\"),\"\")","v":{"$error":"#N/A"}},{"$f":"IF(COLUMN()>=INDIRECT(AQ14),IF(COLUMN()<=INDIRECT(AR14),INDIRECT(AS14),\"\"),\"\")","v":{"$error":"#N/A"}},{"$f":"IF(COLUMN()>=INDIRECT(AQ14),IF(COLUMN()<=INDIRECT(AR14),INDIRECT(AS14),\"\"),\"\")","v":{"$error":"#N/A"}},{"$f":"IF(COLUMN()>=INDIRECT(AQ14),IF(COLUMN()<=INDIRECT(AR14),INDIRECT(AS14),\"\"),\"\")","v":{"$error":"#N/A"}},{"$f":"IF(COLUMN()>=INDIRECT(AQ14),IF(COLUMN()<=INDIRECT(AR14),INDIRECT(AS14),\"\"),\"\")","v":{"$error":"#N/A"}},{"$f":"IF(COLUMN()>=INDIRECT(AQ14),IF(COLUMN()<=INDIRECT(AR14),INDIRECT(AS14),\"\"),\"\")","v":{"$error":"#N/A"}},{"$f":"IF(COLUMN()>=INDIRECT(AQ14),IF(COLUMN()<=INDIRECT(AR14),INDIRECT(AS14),\"\"),\"\")","v":{"$error":"#N/A"}},{"$f":"IF(COLUMN()>=INDIRECT(AQ14),IF(COLUMN()<=INDIRECT(AR14),INDIRECT(AS14),\"\"),\"\")","v":{"$error":"#N/A"}},{"$f":"IF(COLUMN()>=INDIRECT(AQ14),IF(COLUMN()<=INDIRECT(AR14),INDIRECT(AS14),\"\"),\"\")","v":{"$error":"#N/A"}},{"$f":"IF(COLUMN()>=INDIRECT(AQ14),IF(COLUMN()<=INDIRECT(AR14),INDIRECT(AS14),\"\"),\"\")","v":{"$error":"#N/A"}},{"$f":"IF(COLUMN()>=INDIRECT(AQ14),IF(COLUMN()<=INDIRECT(AR14),INDIRECT(AS14),\"\"),\"\")","v":{"$error":"#N/A"}},{"$f":"IF(COLUMN()>=INDIRECT(AQ14),IF(COLUMN()<=INDIRECT(AR14),INDIRECT(AS14),\"\"),\"\")","v":{"$error":"#N/A"}},{"$f":"IF(COLUMN()>=INDIRECT(AQ14),IF(COLUMN()<=INDIRECT(AR14),INDIRECT(AS14),\"\"),\"\")","v":{"$error":"#N/A"}},{"$f":"IF(COLUMN()>=INDIRECT(AQ14),IF(COLUMN()<=INDIRECT(AR14),INDIRECT(AS14),\"\"),\"\")","v":{"$error":"#N/A"}},{"$f":"IF(COLUMN()>=INDIRECT(AQ14),IF(COLUMN()<=INDIRECT(AR14),INDIRECT(AS14),\"\"),\"\")","v":{"$error":"#N/A"}},{"$f":"IF(COLUMN()>=INDIRECT(AQ14),IF(COLUMN()<=INDIRECT(AR14),INDIRECT(AS14),\"\"),\"\")","v":{"$error":"#N/A"}},{"$f":"IF(COLUMN()>=INDIRECT(AQ14),IF(COLUMN()<=INDIRECT(AR14),INDIRECT(AS14),\"\"),\"\")","v":{"$error":"#N/A"}},{"$f":"IF(COLUMN()>=INDIRECT(AQ14),IF(COLUMN()<=INDIRECT(AR14),INDIRECT(AS14),\"\"),\"\")","v":{"$error":"#N/A"}},{"$f":"IF(COLUMN()>=INDIRECT(AQ14),IF(COLUMN()<=INDIRECT(AR14),INDIRECT(AS14),\"\"),\"\")","v":{"$error":"#N/A"}},{"$f":"IF(COLUMN()>=INDIRECT(AQ14),IF(COLUMN()<=INDIRECT(AR14),INDIRECT(AS14),\"\"),\"\")","v":{"$error":"#N/A"}},{"$f":"IF(COLUMN()>=INDIRECT(AQ14),IF(COLUMN()<=INDIRECT(AR14),INDIRECT(AS14),\"\"),\"\")","v":{"$error":"#N/A"}},{"$f":"IF(COLUMN()>=INDIRECT(AQ14),IF(COLUMN()<=INDIRECT(AR14),INDIRECT(AS14),\"\"),\"\")","v":{"$error":"#N/A"}},{"$f":"IF(COLUMN()>=INDIRECT(AQ14),IF(COLUMN()<=INDIRECT(AR14),INDIRECT(AS14),\"\"),\"\")","v":{"$error":"#N/A"}},{"$f":"IF(COLUMN()>=INDIRECT(AQ14),IF(COLUMN()<=INDIRECT(AR14),INDIRECT(AS14),\"\"),\"\")","v":{"$error":"#N/A"}},{"$f":"IF(COLUMN()>=INDIRECT(AQ14),IF(COLUMN()<=INDIRECT(AR14),INDIRECT(AS14),\"\"),\"\")","v":{"$error":"#N/A"}},{"$f":"IF(COLUMN()>=INDIRECT(AQ14),IF(COLUMN()<=INDIRECT(AR14),INDIRECT(AS14),\"\"),\"\")","v":{"$error":"#N/A"}},{"$f":"IF(COLUMN()>=INDIRECT(AQ14),IF(COLUMN()<=INDIRECT(AR14),INDIRECT(AS14),\"\"),\"\")","v":{"$error":"#N/A"}},{"$f":"IF(COLUMN()>=INDIRECT(AQ14),IF(COLUMN()<=INDIRECT(AR14),INDIRECT(AS14),\"\"),\"\")","v":{"$error":"#N/A"}},{"$f":"IF(COLUMN()>=INDIRECT(AQ14),IF(COLUMN()<=INDIRECT(AR14),INDIRECT(AS14),\"\"),\"\")","v":{"$error":"#N/A"}},{"$f":"IF(COLUMN()>=INDIRECT(AQ14),IF(COLUMN()<=INDIRECT(AR14),INDIRECT(AS14),\"\"),\"\")","v":{"$error":"#N/A"}},{"$f":"IF(COLUMN()>=INDIRECT(AQ14),IF(COLUMN()<=INDIRECT(AR14),INDIRECT(AS14),\"\"),\"\")","v":{"$error":"#N/A"}},{"$f":"IF(COLUMN()>=INDIRECT(AQ14),IF(COLUMN()<=INDIRECT(AR14),INDIRECT(AS14),\"\"),\"\")","v":{"$error":"#N/A"}},{"$f":"IF(COLUMN()>=INDIRECT(AQ14),IF(COLUMN()<=INDIRECT(AR14),INDIRECT(AS14),\"\"),\"\")","v":{"$error":"#N/A"}},{"$f":"IF(COLUMN()>=INDIRECT(AQ14),IF(COLUMN()<=INDIRECT(AR14),INDIRECT(AS14),\"\"),\"\")","v":{"$error":"#N/A"}},{"$f":"IF(COLUMN()>=INDIRECT(AQ14),IF(COLUMN()<=INDIRECT(AR14),INDIRECT(AS14),\"\"),\"\")","v":{"$error":"#N/A"}},{"$f":"IF(COLUMN()>=INDIRECT(AQ14),IF(COLUMN()<=INDIRECT(AR14),INDIRECT(AS14),\"\"),\"\")","v":{"$error":"#N/A"}},null,{"$f":"CONCATENATE(\"'\",SUBSTITUTE(SUBSTITUTE(SUBSTITUTE(MID(CELL(\"direccion\",'ETAPA III.a'!M$1),FIND(\"]\",CELL(\"direccion\",'ETAPA III.a'!M$1))+1,LEN(CELL(\"direccion\",'ETAPA III.a'!M$1))),\"$\",\"\"),1,MATCH($A14,'ETAPA III.a'!$K:$K,0)),\"!\",\"!$\"))","v":"'ETAPA III.a'!$M27"},{"$f":"CONCATENATE(\"'\",SUBSTITUTE(SUBSTITUTE(SUBSTITUTE(MID(CELL(\"direccion\",'ETAPA III.a'!N$1),FIND(\"]\",CELL(\"direccion\",'ETAPA III.a'!N$1))+1,LEN(CELL(\"direccion\",'ETAPA III.a'!N$1))),\"$\",\"\"),1,MATCH($A14,'ETAPA III.a'!$K:$K,0)),\"!\",\"!$\"))","v":"'ETAPA III.a'!$N27"},{"$f":"CONCATENATE(\"'\",SUBSTITUTE(SUBSTITUTE(SUBSTITUTE(MID(CELL(\"direccion\",'ETAPA III.a'!L$1),FIND(\"]\",CELL(\"direccion\",'ETAPA III.a'!L$1))+1,LEN(CELL(\"direccion\",'ETAPA III.a'!L$1))),\"$\",\"\"),1,MATCH($A14,'ETAPA III.a'!$K:$K,0)),\"!\",\"!$\"))","v":"'ETAPA III.a'!$L27"}]
[5,{"$f":"IF(COLUMN()>=INDIRECT(AQ15),IF(COLUMN()<=INDIRECT(AR15),INDIRECT(AS15),\"\"),\"\")","v":{"$error":"#N/A"}},{"$f":"IF(COLUMN()>=INDIRECT(AQ15),IF(COLUMN()<=INDIRECT(AR15),INDIRECT(AS15),\"\"),\"\")","v":{"$error":"#N/A"}},{"$f":"IF(COLUMN()>=INDIRECT(AQ15),IF(COLUMN()<=INDIRECT(AR15),INDIRECT(AS15),\"\"),\"\")","v":{"$error":"#N/A"}},{"$f":"IF(COLUMN()>=INDIRECT(AQ15),IF(COLUMN()<=INDIRECT(AR15),INDIRECT(AS15),\"\"),\"\")","v":{"$error":"#N/A"}},{"$f":"IF(COLUMN()>=INDIRECT(AQ15),IF(COLUMN()<=INDIRECT(AR15),INDIRECT(AS15),\"\"),\"\")","v":{"$error":"#N/A"}},{"$f":"IF(COLUMN()>=INDIRECT(AQ15),IF(COLUMN()<=INDIRECT(AR15),INDIRECT(AS15),\"\"),\"\")","v":{"$error":"#N/A"}},{"$f":"IF(COLUMN()>=INDIRECT(AQ15),IF(COLUMN()<=INDIRECT(AR15),INDIRECT(AS15),\"\"),\"\")","v":{"$error":"#N/A"}},{"$f":"IF(COLUMN()>=INDIRECT(AQ15),IF(COLUMN()<=INDIRECT(AR15),INDIRECT(AS15),\"\"),\"\")","v":{"$error":"#N/A"}},{"$f":"IF(COLUMN()>=INDIRECT(AQ15),IF(COLUMN()<=INDIRECT(AR15),INDIRECT(AS15),\"\"),\"\")","v":{"$error":"#N/A"}},{"$f":"IF(COLUMN()>=INDIRECT(AQ15),IF(COLUMN()<=INDIRECT(AR15),INDIRECT(AS15),\"\"),\"\")","v":{"$error":"#N/A"}},{"$f":"IF(COLUMN()>=INDIRECT(AQ15),IF(COLUMN()<=INDIRECT(AR15),INDIRECT(AS15),\"\"),\"\")","v":{"$error":"#N/A"}},{"$f":"IF(COLUMN()>=INDIRECT(AQ15),IF(COLUMN()<=INDIRECT(AR15),INDIRECT(AS15),\"\"),\"\")","v":{"$error":"#N/A"}},{"$f":"IF(COLUMN()>=INDIRECT(AQ15),IF(COLUMN()<=INDIRECT(AR15),INDIRECT(AS15),\"\"),\"\")","v":{"$error":"#N/A"}},{"$f":"IF(COLUMN()>=INDIRECT(AQ15),IF(COLUMN()<=INDIRECT(AR15),INDIRECT(AS15),\"\"),\"\")","v":{"$error":"#N/A"}},{"$f":"IF(COLUMN()>=INDIRECT(AQ15),IF(COLUMN()<=INDIRECT(AR15),INDIRECT(AS15),\"\"),\"\")","v":{"$error":"#N/A"}},{"$f":"IF(COLUMN()>=INDIRECT(AQ15),IF(COLUMN()<=INDIRECT(AR15),INDIRECT(AS15),\"\"),\"\")","v":{"$error":"#N/A"}},{"$f":"IF(COLUMN()>=INDIRECT(AQ15),IF(COLUMN()<=INDIRECT(AR15),INDIRECT(AS15),\"\"),\"\")","v":{"$error":"#N/A"}},{"$f":"IF(COLUMN()>=INDIRECT(AQ15),IF(COLUMN()<=INDIRECT(AR15),INDIRECT(AS15),\"\"),\"\")","v":{"$error":"#N/A"}},{"$f":"IF(COLUMN()>=INDIRECT(AQ15),IF(COLUMN()<=INDIRECT(AR15),INDIRECT(AS15),\"\"),\"\")","v":{"$error":"#N/A"}},{"$f":"IF(COLUMN()>=INDIRECT(AQ15),IF(COLUMN()<=INDIRECT(AR15),INDIRECT(AS15),\"\"),\"\")","v":{"$error":"#N/A"}},{"$f":"IF(COLUMN()>=INDIRECT(AQ15),IF(COLUMN()<=INDIRECT(AR15),INDIRECT(AS15),\"\"),\"\")","v":{"$error":"#N/A"}},{"$f":"IF(COLUMN()>=INDIRECT(AQ15),IF(COLUMN()<=INDIRECT(AR15),INDIRECT(AS15),\"\"),\"\")","v":{"$error":"#N/A"}},{"$f":"IF(COLUMN()>=INDIRECT(AQ15),IF(COLUMN()<=INDIRECT(AR15),INDIRECT(AS15),\"\"),\"\")","v":{"$error":"#N/A"}},{"$f":"IF(COLUMN()>=INDIRECT(AQ15),IF(COLUMN()<=INDIRECT(AR15),INDIRECT(AS15),\"\"),\"\")","v":{"$error":"#N/A"}},{"$f":"IF(COLUMN()>=INDIRECT(AQ15),IF(COLUMN()<=INDIRECT(AR15),INDIRECT(AS15),\"\"),\"\")","v":{"$error":"#N/A"}},{"$f":"IF(COLUMN()>=INDIRECT(AQ15),IF(COLUMN()<=INDIRECT(AR15),INDIRECT(AS15),\"\"),\"\")","v":{"$error":"#N/A"}},{"$f":"IF(COLUMN()>=INDIRECT(AQ15),IF(COLUMN()<=INDIRECT(AR15),INDIRECT(AS15),\"\"),\"\")","v":{"$error":"#N/A"}},{"$f":"IF(COLUMN()>=INDIRECT(AQ15),IF(COLUMN()<=INDIRECT(AR15),INDIRECT(AS15),\"\"),\"\")","v":{"$error":"#N/A"}},{"$f":"IF(COLUMN()>=INDIRECT(AQ15),IF(COLUMN()<=INDIRECT(AR15),INDIRECT(AS15),\"\"),\"\")","v":{"$error":"#N/A"}},{"$f":"IF(COLUMN()>=INDIRECT(AQ15),IF(COLUMN()<=INDIRECT(AR15),INDIRECT(AS15),\"\"),\"\")","v":{"$error":"#N/A"}},{"$f":"IF(COLUMN()>=INDIRECT(AQ15),IF(COLUMN()<=INDIRECT(AR15),INDIRECT(AS15),\"\"),\"\")","v":{"$error":"#N/A"}},{"$f":"IF(COLUMN()>=INDIRECT(AQ15),IF(COLUMN()<=INDIRECT(AR15),INDIRECT(AS15),\"\"),\"\")","v":{"$error":"#N/A"}},{"$f":"IF(COLUMN()>=INDIRECT(AQ15),IF(COLUMN()<=INDIRECT(AR15),INDIRECT(AS15),\"\"),\"\")","v":{"$error":"#N/A"}},{"$f":"IF(COLUMN()>=INDIRECT(AQ15),IF(COLUMN()<=INDIRECT(AR15),INDIRECT(AS15),\"\"),\"\")","v":{"$error":"#N/A"}},{"$f":"IF(COLUMN()>=INDIRECT(AQ15),IF(COLUMN()<=INDIRECT(AR15),INDIRECT(AS15),\"\"),\"\")","v":{"$error":"#N/A"}},{"$f":"IF(COLUMN()>=INDIRECT(AQ15),IF(COLUMN()<=INDIRECT(AR15),INDIRECT(AS15),\"\"),\"\")","v":{"$error":"#N/A"}},{"$f":"IF(COLUMN()>=INDIRECT(AQ15),IF(COLUMN()<=INDIRECT(AR15),INDIRECT(AS15),\"\"),\"\")","v":{"$error":"#N/A"}},{"$f":"IF(COLUMN()>=INDIRECT(AQ15),IF(COLUMN()<=INDIRECT(AR15),INDIRECT(AS15),\"\"),\"\")","v":{"$error":"#N/A"}},{"$f":"IF(COLUMN()>=INDIRECT(AQ15),IF(COLUMN()<=INDIRECT(AR15),INDIRECT(AS15),\"\"),\"\")","v":{"$error":"#N/A"}},{"$f":"IF(COLUMN()>=INDIRECT(AQ15),IF(COLUMN()<=INDIRECT(AR15),INDIRECT(AS15),\"\"),\"\")","v":{"$error":"#N/A"}},null,{"$f":"CONCATENATE(\"'\",SUBSTITUTE(SUBSTITUTE(SUBSTITUTE(MID(CELL(\"direccion\",'ETAPA III.a'!M$1),FIND(\"]\",CELL(\"direccion\",'ETAPA III.a'!M$1))+1,LEN(CELL(\"direccion\",'ETAPA III.a'!M$1))),\"$\",\"\"),1,MATCH($A15,'ETAPA III.a'!$K:$K,0)),\"!\",\"!$\"))","v":"'ETAPA III.a'!$M34"},{"$f":"CONCATENATE(\"'\",SUBSTITUTE(SUBSTITUTE(SUBSTITUTE(MID(CELL(\"direccion\",'ETAPA III.a'!N$1),FIND(\"]\",CELL(\"direccion\",'ETAPA III.a'!N$1))+1,LEN(CELL(\"direccion\",'ETAPA III.a'!N$1))),\"$\",\"\"),1,MATCH($A15,'ETAPA III.a'!$K:$K,0)),\"!\",\"!$\"))","v":"'ETAPA III.a'!$N34"},{"$f":"CONCATENATE(\"'\",SUBSTITUTE(SUBSTITUTE(SUBSTITUTE(MID(CELL(\"direccion\",'ETAPA III.a'!L$1),FIND(\"]\",CELL(\"direccion\",'ETAPA III.a'!L$1))+1,LEN(CELL(\"direccion\",'ETAPA III.a'!L$1))),\"$\",\"\"),1,MATCH($A15,'ETAPA III.a'!$K:$K,0)),\"!\",\"!$\"))","v":"'ETAPA III.a'!$L34"}]
[6,{"$f":"IF(COLUMN()>=INDIRECT(AQ16),IF(COLUMN()<=INDIRECT(AR16),INDIRECT(AS16),\"\"),\"\")","v":{"$error":"#N/A"}},{"$f":"IF(COLUMN()>=INDIRECT(AQ16),IF(COLUMN()<=INDIRECT(AR16),INDIRECT(AS16),\"\"),\"\")","v":{"$error":"#N/A"}},{"$f":"IF(COLUMN()>=INDIRECT(AQ16),IF(COLUMN()<=INDIRECT(AR16),INDIRECT(AS16),\"\"),\"\")","v":{"$error":"#N/A"}},{"$f":"IF(COLUMN()>=INDIRECT(AQ16),IF(COLUMN()<=INDIRECT(AR16),INDIRECT(AS16),\"\"),\"\")","v":{"$error":"#N/A"}},{"$f":"IF(COLUMN()>=INDIRECT(AQ16),IF(COLUMN()<=INDIRECT(AR16),INDIRECT(AS16),\"\"),\"\")","v":{"$error":"#N/A"}},{"$f":"IF(COLUMN()>=INDIRECT(AQ16),IF(COLUMN()<=INDIRECT(AR16),INDIRECT(AS16),\"\"),\"\")","v":{"$error":"#N/A"}},{"$f":"IF(COLUMN()>=INDIRECT(AQ16),IF(COLUMN()<=INDIRECT(AR16),INDIRECT(AS16),\"\"),\"\")","v":{"$error":"#N/A"}},{"$f":"IF(COLUMN()>=INDIRECT(AQ16),IF(COLUMN()<=INDIRECT(AR16),INDIRECT(AS16),\"\"),\"\")","v":{"$error":"#N/A"}},{"$f":"IF(COLUMN()>=INDIRECT(AQ16),IF(COLUMN()<=INDIRECT(AR16),INDIRECT(AS16),\"\"),\"\")","v":{"$error":"#N/A"}},{"$f":"IF(COLUMN()>=INDIRECT(AQ16),IF(COLUMN()<=INDIRECT(AR16),INDIRECT(AS16),\"\"),\"\")","v":{"$error":"#N/A"}},{"$f":"IF(COLUMN()>=INDIRECT(AQ16),IF(COLUMN()<=INDIRECT(AR16),INDIRECT(AS16),\"\"),\"\")","v":{"$error":"#N/A"}},{"$f":"IF(COLUMN()>=INDIRECT(AQ16),IF(COLUMN()<=INDIRECT(AR16),INDIRECT(AS16),\"\"),\"\")","v":{"$error":"#N/A"}},{"$f":"IF(COLUMN()>=INDIRECT(AQ16),IF(COLUMN()<=INDIRECT(AR16),INDIRECT(AS16),\"\"),\"\")","v":{"$error":"#N/A"}},{"$f":"IF(COLUMN()>=INDIRECT(AQ16),IF(COLUMN()<=INDIRECT(AR16),INDIRECT(AS16),\"\"),\"\")","v":{"$error":"#N/A"}},{"$f":"IF(COLUMN()>=INDIRECT(AQ16),IF(COLUMN()<=INDIRECT(AR16),INDIRECT(AS16),\"\"),\"\")","v":{"$error":"#N/A"}},{"$f":"IF(COLUMN()>=INDIRECT(AQ16),IF(COLUMN()<=INDIRECT(AR16),INDIRECT(AS16),\"\"),\"\")","v":{"$error":"#N/A"}},{"$f":"IF(COLUMN()>=INDIRECT(AQ16),IF(COLUMN()<=INDIRECT(AR16),INDIRECT(AS16),\"\"),\"\")","v":{"$error":"#N/A"}},{"$f":"IF(COLUMN()>=INDIRECT(AQ16),IF(COLUMN()<=INDIRECT(AR16),INDIRECT(AS16),\"\"),\"\")","v":{"$error":"#N/A"}},{"$f":"IF(COLUMN()>=INDIRECT(AQ16),IF(COLUMN()<=INDIRECT(AR16),INDIRECT(AS16),\"\"),\"\")","v":{"$error":"#N/A"}},{"$f":"IF(COLUMN()>=INDIRECT(AQ16),IF(COLUMN()<=INDIRECT(AR16),INDIRECT(AS16),\"\"),\"\")","v":{"$error":"#N/A"}},{"$f":"IF(COLUMN()>=INDIRECT(AQ16),IF(COLUMN()<=INDIRECT(AR16),INDIRECT(AS16),\"\"),\"\")","v":{"$error":"#N/A"}},{"$f":"IF(COLUMN()>=INDIRECT(AQ16),IF(COLUMN()<=INDIRECT(AR16),INDIRECT(AS16),\"\"),\"\")","v":{"$error":"#N/A"}},{"$f":"IF(COLUMN()>=INDIRECT(AQ16),IF(COLUMN()<=INDIRECT(AR16),INDIRECT(AS16),\"\"),\"\")","v":{"$error":"#N/A"}},{"$f":"IF(COLUMN()>=INDIRECT(AQ16),IF(COLUMN()<=INDIRECT(AR16),INDIRECT(AS16),\"\"),\"\")","v":{"$error":"#N/A"}},{"$f":"IF(COLUMN()>=INDIRECT(AQ16),IF(COLUMN()<=INDIRECT(AR16),INDIRECT(AS16),\"\"),\"\")","v":{"$error":"#N/A"}},{"$f":"IF(COLUMN()>=INDIRECT(AQ16),IF(COLUMN()<=INDIRECT(AR16),INDIRECT(AS16),\"\"),\"\")","v":{"$error":"#N/A"}},{"$f":"IF(COLUMN()>=INDIRECT(AQ16),IF(COLUMN()<=INDIRECT(AR16),INDIRECT(AS16),\"\"),\"\")","v":{"$error":"#N/A"}},{"$f":"IF(COLUMN()>=INDIRECT(AQ16),IF(COLUMN()<=INDIRECT(AR16),INDIRECT(AS16),\"\"),\"\")","v":{"$error":"#N/A"}},{"$f":"IF(COLUMN()>=INDIRECT(AQ16),IF(COLUMN()<=INDIRECT(AR16),INDIRECT(AS16),\"\"),\"\")","v":{"$error":"#N/A"}},{"$f":"IF(COLUMN()>=INDIRECT(AQ16),IF(COLUMN()<=INDIRECT(AR16),INDIRECT(AS16),\"\"),\"\")","v":{"$error":"#N/A"}},{"$f":"IF(COLUMN()>=INDIRECT(AQ16),IF(COLUMN()<=INDIRECT(AR16),INDIRECT(AS16),\"\"),\"\")","v":{"$error":"#N/A"}},{"$f":"IF(COLUMN()>=INDIRECT(AQ16),IF(COLUMN()<=INDIRECT(AR16),INDIRECT(AS16),\"\"),\"\")","v":{"$error":"#N/A"}},{"$f":"IF(COLUMN()>=INDIRECT(AQ16),IF(COLUMN()<=INDIRECT(AR16),INDIRECT(AS16),\"\"),\"\")","v":{"$error":"#N/A"}},{"$f":"IF(COLUMN()>=INDIRECT(AQ16),IF(COLUMN()<=INDIRECT(AR16),INDIRECT(AS16),\"\"),\"\")","v":{"$error":"#N/A"}},{"$f":"IF(COLUMN()>=INDIRECT(AQ16),IF(COLUMN()<=INDIRECT(AR16),INDIRECT(AS16),\"\"),\"\")","v":{"$error":"#N/A"}},{"$f":"IF(COLUMN()>=INDIRECT(AQ16),IF(COLUMN()<=INDIRECT(AR16),INDIRECT(AS16),\"\"),\"\")","v":{"$error":"#N/A"}},{"$f":"IF(COLUMN()>=INDIRECT(AQ16),IF(COLUMN()<=INDIRECT(AR16),INDIRECT(AS16),\"\"),\"\")","v":{"$error":"#N/A"}},{"$f":"IF(COLUMN()>=INDIRECT(AQ16),IF(COLUMN()<=INDIRECT(AR16),INDIRECT(AS16),\"\"),\"\")","v":{"$error":"#N/A"}},{"$f":"IF(COLUMN()>=INDIRECT(AQ16),IF(COLUMN()<=INDIRECT(AR16),INDIRECT(AS16),\"\"),\"\")","v":{"$error":"#N/A"}},{"$f":"IF(COLUMN()>=INDIRECT(AQ16),IF(COLUMN()<=INDIRECT(AR16),INDIRECT(AS16),\"\"),\"\")","v":{"$error":"#N/A"}},null,{"$f":"CONCATENATE(\"'\",SUBSTITUTE(SUBSTITUTE(SUBSTITUTE(MID(CELL(\"direccion\",'ETAPA III.a'!M$1),FIND(\"]\",CELL(\"direccion\",'ETAPA III.a'!M$1))+1,LEN(CELL(\"direccion\",'ETAPA III.a'!M$1))),\"$\",\"\"),1,MATCH($A16,'ETAPA III.a'!$K:$K,0)),\"!\",\"!$\"))","v":"'ETAPA III.a'!$M41"},{"$f":"CONCATENATE(\"'\",SUBSTITUTE(SUBSTITUTE(SUBSTITUTE(MID(CELL(\"direccion\",'ETAPA III.a'!N$1),FIND(\"]\",CELL(\"direccion\",'ETAPA III.a'!N$1))+1,LEN(CELL(\"direccion\",'ETAPA III.a'!N$1))),\"$\",\"\"),1,MATCH($A16,'ETAPA III.a'!$K:$K,0)),\"!\",\"!$\"))","v":"'ETAPA III.a'!$N41"},{"$f":"CONCATENATE(\"'\",SUBSTITUTE(SUBSTITUTE(SUBSTITUTE(MID(CELL(\"direccion\",'ETAPA III.a'!L$1),FIND(\"]\",CELL(\"direccion\",'ETAPA III.a'!L$1))+1,LEN(CELL(\"direccion\",'ETAPA III.a'!L$1))),\"$\",\"\"),1,MATCH($A16,'ETAPA III.a'!$K:$K,0)),\"!\",\"!$\"))","v":"'ETAPA III.a'!$L41"}]
[7,{"$f":"IF(COLUMN()>=INDIRECT(AQ17),IF(COLUMN()<=INDIRECT(AR17),INDIRECT(AS17),\"\"),\"\")","v":{"$error":"#N/A"}},{"$f":"IF(COLUMN()>=INDIRECT(AQ17),IF(COLUMN()<=INDIRECT(AR17),INDIRECT(AS17),\"\"),\"\")","v":{"$error":"#N/A"}},{"$f":"IF(COLUMN()>=INDIRECT(AQ17),IF(COLUMN()<=INDIRECT(AR17),INDIRECT(AS17),\"\"),\"\")","v":{"$error":"#N/A"}},{"$f":"IF(COLUMN()>=INDIRECT(AQ17),IF(COLUMN()<=INDIRECT(AR17),INDIRECT(AS17),\"\"),\"\")","v":{"$error":"#N/A"}},{"$f":"IF(COLUMN()>=INDIRECT(AQ17),IF(COLUMN()<=INDIRECT(AR17),INDIRECT(AS17),\"\"),\"\")","v":{"$error":"#N/A"}},{"$f":"IF(COLUMN()>=INDIRECT(AQ17),IF(COLUMN()<=INDIRECT(AR17),INDIRECT(AS17),\"\"),\"\")","v":{"$error":"#N/A"}},{"$f":"IF(COLUMN()>=INDIRECT(AQ17),IF(COLUMN()<=INDIRECT(AR17),INDIRECT(AS17),\"\"),\"\")","v":{"$error":"#N/A"}},{"$f":"IF(COLUMN()>=INDIRECT(AQ17),IF(COLUMN()<=INDIRECT(AR17),INDIRECT(AS17),\"\"),\"\")","v":{"$error":"#N/A"}},{"$f":"IF(COLUMN()>=INDIRECT(AQ17),IF(COLUMN()<=INDIRECT(AR17),INDIRECT(AS17),\"\"),\"\")","v":{"$error":"#N/A"}},{"$f":"IF(COLUMN()>=INDIRECT(AQ17),IF(COLUMN()<=INDIRECT(AR17),INDIRECT(AS17),\"\"),\"\")","v":{"$error":"#N/A"}},{"$f":"IF(COLUMN()>=INDIRECT(AQ17),IF(COLUMN()<=INDIRECT(AR17),INDIRECT(AS17),\"\"),\"\")","v":{"$error":"#N/A"}},{"$f":"IF(COLUMN()>=INDIRECT(AQ17),IF(COLUMN()<=INDIRECT(AR17),INDIRECT(AS17),\"\"),\"\")","v":{"$error":"#N/A"}},{"$f":"IF(COLUMN()>=INDIRECT(AQ17),IF(COLUMN()<=INDIRECT(AR17),INDIRECT(AS17),\"\"),\"\")","v":{"$error":"#N/A"}},{"$f":"IF(COLUMN()>=INDIRECT(AQ17),IF(COLUMN()<=INDIRECT(AR17),INDIRECT(AS17),\"\"),\"\")","v":{"$error":"#N/A"}},{"$f":"IF(COLUMN()>=INDIRECT(AQ17),IF(COLUMN()<=INDIRECT(AR17),INDIRECT(AS17),\"\"),\"\")","v":{"$error":"#N/A"}},{"$f":"IF(COLUMN()>=INDIRECT(AQ17),IF(COLUMN()<=INDIRECT(AR17),INDIRECT(AS17),\"\"),\"\")","v":{"$error":"#N/A"}},{"$f":"IF(COLUMN()>=INDIRECT(AQ17),IF(COLUMN()<=INDIRECT(AR17),INDIRECT(AS17),\"\"),\"\")","v":{"$error":"#N/A"}},{"$f":"IF(COLUMN()>=INDIRECT(AQ17),IF(COLUMN()<=INDIRECT(AR17),INDIRECT(AS17),\"\"),\"\")","v":{"$error":"#N/A"}},{"$f":"IF(COLUMN()>=INDIRECT(AQ17),IF(COLUMN()<=INDIRECT(AR17),INDIRECT(AS17),\"\"),\"\")","v":{"$error":"#N/A"}},{"$f":"IF(COLUMN()>=INDIRECT(AQ17),IF(COLUMN()<=INDIRECT(AR17),INDIRECT(AS17),\"\"),\"\")","v":{"$error":"#N/A"}},{"$f":"IF(COLUMN()>=INDIRECT(AQ17),IF(COLUMN()<=INDIRECT(AR17),INDIRECT(AS17),\"\"),\"\")","v":{"$error":"#N/A"}},{"$f":"IF(COLUMN()>=INDIRECT(AQ17),IF(COLUMN()<=INDIRECT(AR17),INDIRECT(AS17),\"\"),\"\")","v":{"$error":"#N/A"}},{"$f":"IF(COLUMN()>=INDIRECT(AQ17),IF(COLUMN()<=INDIRECT(AR17),INDIRECT(AS17),\"\"),\"\")","v":{"$error":"#N/A"}},{"$f":"IF(COLUMN()>=INDIRECT(AQ17),IF(COLUMN()<=INDIRECT(AR17),INDIRECT(AS17),\"\"),\"\")","v":{"$error":"#N/A"}},{"$f":"IF(COLUMN()>=INDIRECT(AQ17),IF(COLUMN()<=INDIRECT(AR17),INDIRECT(AS17),\"\"),\"\")","v":{"$error":"#N/A"}},{"$f":"IF(COLUMN()>=INDIRECT(AQ17),IF(COLUMN()<=INDIRECT(AR17),INDIRECT(AS17),\"\"),\"\")","v":{"$error":"#N/A"}},{"$f":"IF(COLUMN()>=INDIRECT(AQ17),IF(COLUMN()<=INDIRECT(AR17),INDIRECT(AS17),\"\"),\"\")","v":{"$error":"#N/A"}},{"$f":"IF(COLUMN()>=INDIRECT(AQ17),IF(COLUMN()<=INDIRECT(AR17),INDIRECT(AS17),\"\"),\"\")","v":{"$error":"#N/A"}},{"$f":"IF(COLUMN()>=INDIRECT(AQ17),IF(COLUMN()<=INDIRECT(AR17),INDIRECT(AS17),\"\"),\"\")","v":{"$error":"#N/A"}},{"$f":"IF(COLUMN()>=INDIRECT(AQ17),IF(COLUMN()<=INDIRECT(AR17),INDIRECT(AS17),\"\"),\"\")","v":{"$error":"#N/A"}},{"$f":"IF(COLUMN()>=INDIRECT(AQ17),IF(COLUMN()<=INDIRECT(AR17),INDIRECT(AS17),\"\"),\"\")","v":{"$error":"#N/A"}},{"$f":"IF(COLUMN()>=INDIRECT(AQ17),IF(COLUMN()<=INDIRECT(AR17),INDIRECT(AS17),\"\"),\"\")","v":{"$error":"#N/A"}},{"$f":"IF(COLUMN()>=INDIRECT(AQ17),IF(COLUMN()<=INDIRECT(AR17),INDIRECT(AS17),\"\"),\"\")","v":{"$error":"#N/A"}},{"$f":"IF(COLUMN()>=INDIRECT(AQ17),IF(COLUMN()<=INDIRECT(AR17),INDIRECT(AS17),\"\"),\"\")","v":{"$error":"#N/A"}},{"$f":"IF(COLUMN()>=INDIRECT(AQ17),IF(COLUMN()<=INDIRECT(AR17),INDIRECT(AS17),\"\"),\"\")","v":{"$error":"#N/A"}},{"$f":"IF(COLUMN()>=INDIRECT(AQ17),IF(COLUMN()<=INDIRECT(AR17),INDIRECT(AS17),\"\"),\"\")","v":{"$error":"#N/A"}},{"$f":"IF(COLUMN()>=INDIRECT(AQ17),IF(COLUMN()<=INDIRECT(AR17),INDIRECT(AS17),\"\"),\"\")","v":{"$error":"#N/A"}},{"$f":"IF(COLUMN()>=INDIRECT(AQ17),IF(COLUMN()<=INDIRECT(AR17),INDIRECT(AS17),\"\"),\"\")","v":{"$error":"#N/A"}},{"$f":"IF(COLUMN()>=INDIRECT(AQ17),IF(COLUMN()<=INDIRECT(AR17),INDIRECT(AS17),\"\"),\"\")","v":{"$error":"#N/A"}},{"$f":"IF(COLUMN()>=INDIRECT(AQ17),IF(COLUMN()<=INDIRECT(AR17),INDIRECT(AS17),\"\"),\"\")","v":{"$error":"#N/A"}},null,{"$f":"CONCATENATE(\"'\",SUBSTITUTE(SUBSTITUTE(SUBSTITUTE(MID(CELL(\"direccion\",'ETAPA III.a'!M$1),FIND(\"]\",CELL(\"direccion\",'ETAPA III.a'!M$1))+1,LEN(CELL(\"direccion\",'ETAPA III.a'!M$1))),\"$\",\"\"),1,MATCH($A17,'ETAPA III.a'!$K:$K,0)),\"!\",\"!$\"))","v":"'ETAPA III.a'!$M51"},{"$f":"CONCATENATE(\"'\",SUBSTITUTE(SUBSTITUTE(SUBSTITUTE(MID(CELL(\"direccion\",'ETAPA III.a'!N$1),FIND(\"]\",CELL(\"direccion\",'ETAPA III.a'!N$1))+1,LEN(CELL(\"direccion\",'ETAPA III.a'!N$1))),\"$\",\"\"),1,MATCH($A17,'ETAPA III.a'!$K:$K,0)),\"!\",\"!$\"))","v":"'ETAPA III.a'!$N51"},{"$f":"CONCATENATE(\"'\",SUBSTITUTE(SUBSTITUTE(SUBSTITUTE(MID(CELL(\"direccion\",'ETAPA III.a'!L$1),FIND(\"]\",CELL(\"direccion\",'ETAPA III.a'!L$1))+1,LEN(CELL(\"direccion\",'ETAPA III.a'!L$1))),\"$\",\"\"),1,MATCH($A17,'ETAPA III.a'!$K:$K,0)),\"!\",\"!$\"))","v":"'ETAPA III.a'!$L51"}]
[8,{"$f":"IF(COLUMN()>=INDIRECT(AQ18),IF(COLUMN()<=INDIRECT(AR18),INDIRECT(AS18),\"\"),\"\")","v":{"$error":"#N/A"}},{"$f":"IF(COLUMN()>=INDIRECT(AQ18),IF(COLUMN()<=INDIRECT(AR18),INDIRECT(AS18),\"\"),\"\")","v":{"$error":"#N/A"}},{"$f":"IF(COLUMN()>=INDIRECT(AQ18),IF(COLUMN()<=INDIRECT(AR18),INDIRECT(AS18),\"\"),\"\")","v":{"$error":"#N/A"}},{"$f":"IF(COLUMN()>=INDIRECT(AQ18),IF(COLUMN()<=INDIRECT(AR18),INDIRECT(AS18),\"\"),\"\")","v":{"$error":"#N/A"}},{"$f":"IF(COLUMN()>=INDIRECT(AQ18),IF(COLUMN()<=INDIRECT(AR18),INDIRECT(AS18),\"\"),\"\")","v":{"$error":"#N/A"}},{"$f":"IF(COLUMN()>=INDIRECT(AQ18),IF(COLUMN()<=INDIRECT(AR18),INDIRECT(AS18),\"\"),\"\")","v":{"$error":"#N/A"}},{"$f":"IF(COLUMN()>=INDIRECT(AQ18),IF(COLUMN()<=INDIRECT(AR18),INDIRECT(AS18),\"\"),\"\")","v":{"$error":"#N/A"}},{"$f":"IF(COLUMN()>=INDIRECT(AQ18),IF(COLUMN()<=INDIRECT(AR18),INDIRECT(AS18),\"\"),\"\")","v":{"$error":"#N/A"}},{"$f":"IF(COLUMN()>=INDIRECT(AQ18),IF(COLUMN()<=INDIRECT(AR18),INDIRECT(AS18),\"\"),\"\")","v":{"$error":"#N/A"}},{"$f":"IF(COLUMN()>=INDIRECT(AQ18),IF(COLUMN()<=INDIRECT(AR18),INDIRECT(AS18),\"\"),\"\")","v":{"$error":"#N/A"}},{"$f":"IF(COLUMN()>=INDIRECT(AQ18),IF(COLUMN()<=INDIRECT(AR18),INDIRECT(AS18),\"\"),\"\")","v":{"$error":"#N/A"}},{"$f":"IF(COLUMN()>=INDIRECT(AQ18),IF(COLUMN()<=INDIRECT(AR18),INDIRECT(AS18),\"\"),\"\")","v":{"$error":"#N/A"}},{"$f":"IF(COLUMN()>=INDIRECT(AQ18),IF(COLUMN()<=INDIRECT(AR18),INDIRECT(AS18),\"\"),\"\")","v":{"$error":"#N/A"}},{"$f":"IF(COLUMN()>=INDIRECT(AQ18),IF(COLUMN()<=INDIRECT(AR18),INDIRECT(AS18),\"\"),\"\")","v":{"$error":"#N/A"}},{"$f":"IF(COLUMN()>=INDIRECT(AQ18),IF(COLUMN()<=INDIRECT(AR18),INDIRECT(AS18),\"\"),\"\")","v":{"$error":"#N/A"}},{"$f":"IF(COLUMN()>=INDIRECT(AQ18),IF(COLUMN()<=INDIRECT(AR18),INDIRECT(AS18),\"\"),\"\")","v":{"$error":"#N/A"}},{"$f":"IF(COLUMN()>=INDIRECT(AQ18),IF(COLUMN()<=INDIRECT(AR18),INDIRECT(AS18),\"\"),\"\")","v":{"$error":"#N/A"}},{"$f":"IF(COLUMN()>=INDIRECT(AQ18),IF(COLUMN()<=INDIRECT(AR18),INDIRECT(AS18),\"\"),\"\")","v":{"$error":"#N/A"}},{"$f":"IF(COLUMN()>=INDIRECT(AQ18),IF(COLUMN()<=INDIRECT(AR18),INDIRECT(AS18),\"\"),\"\")","v":{"$error":"#N/A"}},{"$f":"IF(COLUMN()>=INDIRECT(AQ18),IF(COLUMN()<=INDIRECT(AR18),INDIRECT(AS18),\"\"),\"\")","v":{"$error":"#N/A"}},{"$f":"IF(COLUMN()>=INDIRECT(AQ18),IF(COLUMN()<=INDIRECT(AR18),INDIRECT(AS18),\"\"),\"\")","v":{"$error":"#N/A"}},{"$f":"IF(COLUMN()>=INDIRECT(AQ18),IF(COLUMN()<=INDIRECT(AR18),INDIRECT(AS18),\"\"),\"\")","v":{"$error":"#N/A"}},{"$f":"IF(COLUMN()>=INDIRECT(AQ18),IF(COLUMN()<=INDIRECT(AR18),INDIRECT(AS18),\"\"),\"\")","v":{"$error":"#N/A"}},{"$f":"IF(COLUMN()>=INDIRECT(AQ18),IF(COLUMN()<=INDIRECT(AR18),INDIRECT(AS18),\"\"),\"\")","v":{"$error":"#N/A"}},{"$f":"IF(COLUMN()>=INDIRECT(AQ18),IF(COLUMN()<=INDIRECT(AR18),INDIRECT(AS18),\"\"),\"\")","v":{"$error":"#N/A"}},{"$f":"IF(COLUMN()>=INDIRECT(AQ18),IF(COLUMN()<=INDIRECT(AR18),INDIRECT(AS18),\"\"),\"\")","v":{"$error":"#N/A"}},{"$f":"IF(COLUMN()>=INDIRECT(AQ18),IF(COLUMN()<=INDIRECT(AR18),INDIRECT(AS18),\"\"),\"\")","v":{"$error":"#N/A"}},{"$f":"IF(COLUMN()>=INDIRECT(AQ18),IF(COLUMN()<=INDIRECT(AR18),INDIRECT(AS18),\"\"),\"\")","v":{"$error":"#N/A"}},{"$f":"IF(COLUMN()>=INDIRECT(AQ18),IF(COLUMN()<=INDIRECT(AR18),INDIRECT(AS18),\"\"),\"\")","v":{"$error":"#N/A"}},{"$f":"IF(COLUMN()>=INDIRECT(AQ18),IF(COLUMN()<=INDIRECT(AR18),INDIRECT(AS18),\"\"),\"\")","v":{"$error":"#N/A"}},{"$f":"IF(COLUMN()>=INDIRECT(AQ18),IF(COLUMN()<=INDIRECT(AR18),INDIRECT(AS18),\"\"),\"\")","v":{"$error":"#N/A"}},{"$f":"IF(COLUMN()>=INDIRECT(AQ18),IF(COLUMN()<=INDIRECT(AR18),INDIRECT(AS18),\"\"),\"\")","v":{"$error":"#N/A"}},{"$f":"IF(COLUMN()>=INDIRECT(AQ18),IF(COLUMN()<=INDIRECT(AR18),INDIRECT(AS18),\"\"),\"\")","v":{"$error":"#N/A"}},{"$f":"IF(COLUMN()>=INDIRECT(AQ18),IF(COLUMN()<=INDIRECT(AR18),INDIRECT(AS18),\"\"),\"\")","v":{"$error":"#N/A"}},{"$f":"IF(COLUMN()>=INDIRECT(AQ18),IF(COLUMN()<=INDIRECT(AR18),INDIRECT(AS18),\"\"),\"\")","v":{"$error":"#N/A"}},{"$f":"IF(COLUMN()>=INDIRECT(AQ18),IF(COLUMN()<=INDIRECT(AR18),INDIRECT(AS18),\"\"),\"\")","v":{"$error":"#N/A"}},{"$f":"IF(COLUMN()>=INDIRECT(AQ18),IF(COLUMN()<=INDIRECT(AR18),INDIRECT(AS18),\"\"),\"\")","v":{"$error":"#N/A"}},{"$f":"IF(COLUMN()>=INDIRECT(AQ18),IF(COLUMN()<=INDIRECT(AR18),INDIRECT(AS18),\"\"),\"\")","v":{"$error":"#N/A"}},{"$f":"IF(COLUMN()>=INDIRECT(AQ18),IF(COLUMN()<=INDIRECT(AR18),INDIRECT(AS18),\"\"),\"\")","v":{"$error":"#N/A"}},{"$f":"IF(COLUMN()>=INDIRECT(AQ18),IF(COLUMN()<=INDIRECT(AR18),INDIRECT(AS18),\"\"),\"\")","v":{"$error":"#N/A"}},null,{"$f":"CONCATENATE(\"'\",SUBSTITUTE(SUBSTITUTE(SUBSTITUTE(MID(CELL(\"direccion\",'ETAPA III.a'!M$1),FIND(\"]\",CELL(\"direccion\",'ETAPA III.a'!M$1))+1,LEN(CELL(\"direccion\",'ETAPA III.a'!M$1))),\"$\",\"\"),1,MATCH($A18,'ETAPA III.a'!$K:$K,0)),\"!\",\"!$\"))","v":"'ETAPA III.a'!$M58"},{"$f":"CONCATENATE(\"'\",SUBSTITUTE(SUBSTITUTE(SUBSTITUTE(MID(CELL(\"direccion\",'ETAPA III.a'!N$1),FIND(\"]\",CELL(\"direccion\",'ETAPA III.a'!N$1))+1,LEN(CELL(\"direccion\",'ETAPA III.a'!N$1))),\"$\",\"\"),1,MATCH($A18,'ETAPA III.a'!$K:$K,0)),\"!\",\"!$\"))","v":"'ETAPA III.a'!$N58"},{"$f":"CONCATENATE(\"'\",SUBSTITUTE(SUBSTITUTE(SUBSTITUTE(MID(CELL(\"direccion\",'ETAPA III.a'!L$1),FIND(\"]\",CELL(\"direccion\",'ETAPA III.a'!L$1))+1,LEN(CELL(\"direccion\",'ETAPA III.a'!L$1))),\"$\",\"\"),1,MATCH($A18,'ETAPA III.a'!$K:$K,0)),\"!\",\"!$\"))","v":"'ETAPA III.a'!$L58"}]
[9,{"$f":"IF(COLUMN()>=INDIRECT(AQ19),IF(COLUMN()<=INDIRECT(AR19),INDIRECT(AS19),\"\"),\"\")","v":{"$error":"#N/A"}},{"$f":"IF(COLUMN()>=INDIRECT(AQ19),IF(COLUMN()<=INDIRECT(AR19),INDIRECT(AS19),\"\"),\"\")","v":{"$error":"#N/A"}},{"$f":"IF(COLUMN()>=INDIRECT(AQ19),IF(COLUMN()<=INDIRECT(AR19),INDIRECT(AS19),\"\"),\"\")","v":{"$error":"#N/A"}},{"$f":"IF(COLUMN()>=INDIRECT(AQ19),IF(COLUMN()<=INDIRECT(AR19),INDIRECT(AS19),\"\"),\"\")","v":{"$error":"#N/A"}},{"$f":"IF(COLUMN()>=INDIRECT(AQ19),IF(COLUMN()<=INDIRECT(AR19),INDIRECT(AS19),\"\"),\"\")","v":{"$error":"#N/A"}},{"$f":"IF(COLUMN()>=INDIRECT(AQ19),IF(COLUMN()<=INDIRECT(AR19),INDIRECT(AS19),\"\"),\"\")","v":{"$error":"#N/A"}},{"$f":"IF(COLUMN()>=INDIRECT(AQ19),IF(COLUMN()<=INDIRECT(AR19),INDIRECT(AS19),\"\"),\"\")","v":{"$error":"#N/A"}},{"$f":"IF(COLUMN()>=INDIRECT(AQ19),IF(COLUMN()<=INDIRECT(AR19),INDIRECT(AS19),\"\"),\"\")","v":{"$error":"#N/A"}},{"$f":"IF(COLUMN()>=INDIRECT(AQ19),IF(COLUMN()<=INDIRECT(AR19),INDIRECT(AS19),\"\"),\"\")","v":{"$error":"#N/A"}},{"$f":"IF(COLUMN()>=INDIRECT(AQ19),IF(COLUMN()<=INDIRECT(AR19),INDIRECT(AS19),\"\"),\"\")","v":{"$error":"#N/A"}},{"$f":"IF(COLUMN()>=INDIRECT(AQ19),IF(COLUMN()<=INDIRECT(AR19),INDIRECT(AS19),\"\"),\"\")","v":{"$error":"#N/A"}},{"$f":"IF(COLUMN()>=INDIRECT(AQ19),IF(COLUMN()<=INDIRECT(AR19),INDIRECT(AS19),\"\"),\"\")","v":{"$error":"#N/A"}},{"$f":"IF(COLUMN()>=INDIRECT(AQ19),IF(COLUMN()<=INDIRECT(AR19),INDIRECT(AS19),\"\"),\"\")","v":{"$error":"#N/A"}},{"$f":"IF(COLUMN()>=INDIRECT(AQ19),IF(COLUMN()<=INDIRECT(AR19),INDIRECT(AS19),\"\"),\"\")","v":{"$error":"#N/A"}},{"$f":"IF(COLUMN()>=INDIRECT(AQ19),IF(COLUMN()<=INDIRECT(AR19),INDIRECT(AS19),\"\"),\"\")","v":{"$error":"#N/A"}},{"$f":"IF(COLUMN()>=INDIRECT(AQ19),IF(COLUMN()<=INDIRECT(AR19),INDIRECT(AS19),\"\"),\"\")","v":{"$error":"#N/A"}},{"$f":"IF(COLUMN()>=INDIRECT(AQ19),IF(COLUMN()<=INDIRECT(AR19),INDIRECT(AS19),\"\"),\"\")","v":{"$error":"#N/A"}},{"$f":"IF(COLUMN()>=INDIRECT(AQ19),IF(COLUMN()<=INDIRECT(AR19),INDIRECT(AS19),\"\"),\"\")","v":{"$error":"#N/A"}},{"$f":"IF(COLUMN()>=INDIRECT(AQ19),IF(COLUMN()<=INDIRECT(AR19),INDIRECT(AS19),\"\"),\"\")","v":{"$error":"#N/A"}},{"$f":"IF(COLUMN()>=INDIRECT(AQ19),IF(COLUMN()<=INDIRECT(AR19),INDIRECT(AS19),\"\"),\"\")","v":{"$error":"#N/A"}},{"$f":"IF(COLUMN()>=INDIRECT(AQ19),IF(COLUMN()<=INDIRECT(AR19),INDIRECT(AS19),\"\"),\"\")","v":{"$error":"#N/A"}},{"$f":"IF(COLUMN()>=INDIRECT(AQ19),IF(COLUMN()<=INDIRECT(AR19),INDIRECT(AS19),\"\"),\"\")","v":{"$error":"#N/A"}},{"$f":"IF(COLUMN()>=INDIRECT(AQ19),IF(COLUMN()<=INDIRECT(AR19),INDIRECT(AS19),\"\"),\"\")","v":{"$error":"#N/A"}},{"$f":"IF(COLUMN()>=INDIRECT(AQ19),IF(COLUMN()<=INDIRECT(AR19),INDIRECT(AS19),\"\"),\"\")","v":{"$error":"#N/A"}},{"$f":"IF(COLUMN()>=INDIRECT(AQ19),IF(COLUMN()<=INDIRECT(AR19),INDIRECT(AS19),\"\"),\"\")","v":{"$error":"#N/A"}},{"$f":"IF(COLUMN()>=INDIRECT(AQ19),IF(COLUMN()<=INDIRECT(AR19),INDIRECT(AS19),\"\"),\"\")","v":{"$error":"#N/A"}},{"$f":"IF(COLUMN()>=INDIRECT(AQ19),IF(COLUMN()<=INDIRECT(AR19),INDIRECT(AS19),\"\"),\"\")","v":{"$error":"#N/A"}},{"$f":"IF(COLUMN()>=INDIRECT(AQ19),IF(COLUMN()<=INDIRECT(AR19),INDIRECT(AS19),\"\"),\"\")","v":{"$error":"#N/A"}},{"$f":"IF(COLUMN()>=INDIRECT(AQ19),IF(COLUMN()<=INDIRECT(AR19),INDIRECT(AS19),\"\"),\"\")","v":{"$error":"#N/A"}},{"$f":"IF(COLUMN()>=INDIRECT(AQ19),IF(COLUMN()<=INDIRECT(AR19),INDIRECT(AS19),\"\"),\"\")","v":{"$error":"#N/A"}},{"$f":"IF(COLUMN()>=INDIRECT(AQ19),IF(COLUMN()<=INDIRECT(AR19),INDIRECT(AS19),\"\"),\"\")","v":{"$error":"#N/A"}},{"$f":"IF(COLUMN()>=INDIRECT(AQ19),IF(COLUMN()<=INDIRECT(AR19),INDIRECT(AS19),\"\"),\"\")","v":{"$error":"#N/A"}},{"$f":"IF(COLUMN()>=INDIRECT(AQ19),IF(COLUMN()<=INDIRECT(AR19),INDIRECT(AS19),\"\"),\"\")","v":{"$error":"#N/A"}},{"$f":"IF(COLUMN()>=INDIRECT(AQ19),IF(COLUMN()<=INDIRECT(AR19),INDIRECT(AS19),\"\"),\"\")","v":{"$error":"#N/A"}},{"$f":"IF(COLUMN()>=INDIRECT(AQ19),IF(COLUMN()<=INDIRECT(AR19),INDIRECT(AS19),\"\"),\"\")","v":{"$error":"#N/A"}},{"$f":"IF(COLUMN()>=INDIRECT(AQ19),IF(COLUMN()<=INDIRECT(AR19),INDIRECT(AS19),\"\"),\"\")","v":{"$error":"#N/A"}},{"$f":"IF(COLUMN()>=INDIRECT(AQ19),IF(COLUMN()<=INDIRECT(AR19),INDIRECT(AS19),\"\"),\"\")","v":{"$error":"#N/A"}},{"$f":"IF(COLUMN()>=INDIRECT(AQ19),IF(COLUMN()<=INDIRECT(AR19),INDIRECT(AS19),\"\"),\"\")","v":{"$error":"#N/A"}},{"$f":"IF(COLUMN()>=INDIRECT(AQ19),IF(COLUMN()<=INDIRECT(AR19),INDIRECT(AS19),\"\"),\"\")","v":{"$error":"#N/A"}},{"$f":"IF(COLUMN()>=INDIRECT(AQ19),IF(COLUMN()<=INDIRECT(AR19),INDIRECT(AS19),\"\"),\"\")","v":{"$error":"#N/A"}},null,{"$f":"CONCATENATE(\"'\",SUBSTITUTE(SUBSTITUTE(SUBSTITUTE(MID(CELL(\"direccion\",'ETAPA III.a'!M$1),FIND(\"]\",CELL(\"direccion\",'ETAPA III.a'!M$1))+1,LEN(CELL(\"direccion\",'ETAPA III.a'!M$1))),\"$\",\"\"),1,MATCH($A19,'ETAPA III.a'!$K:$K,0)),\"!\",\"!$\"))","v":"'ETAPA III.a'!$M65"},{"$f":"CONCATENATE(\"'\",SUBSTITUTE(SUBSTITUTE(SUBSTITUTE(MID(CELL(\"direccion\",'ETAPA III.a'!N$1),FIND(\"]\",CELL(\"direccion\",'ETAPA III.a'!N$1))+1,LEN(CELL(\"direccion\",'ETAPA III.a'!N$1))),\"$\",\"\"),1,MATCH($A19,'ETAPA III.a'!$K:$K,0)),\"!\",\"!$\"))","v":"'ETAPA III.a'!$N65"},{"$f":"CONCATENATE(\"'\",SUBSTITUTE(SUBSTITUTE(SUBSTITUTE(MID(CELL(\"direccion\",'ETAPA III.a'!L$1),FIND(\"]\",CELL(\"direccion\",'ETAPA III.a'!L$1))+1,LEN(CELL(\"direccion\",'ETAPA III.a'!L$1))),\"$\",\"\"),1,MATCH($A19,'ETAPA III.a'!$K:$K,0)),\"!\",\"!$\"))","v":"'ETAPA III.a'!$L65"}]
[10,{"$f":"IF(COLUMN()>=INDIRECT(AQ20),IF(COLUMN()<=INDIRECT(AR20),INDIRECT(AS20),\"\"),\"\")","v":{"$error":"#N/A"}},{"$f":"IF(COLUMN()>=INDIRECT(AQ20),IF(COLUMN()<=INDIRECT(AR20),INDIRECT(AS20),\"\"),\"\")","v":{"$error":"#N/A"}},{"$f":"IF(COLUMN()>=INDIRECT(AQ20),IF(COLUMN()<=INDIRECT(AR20),INDIRECT(AS20),\"\"),\"\")","v":{"$error":"#N/A"}},{"$f":"IF(COLUMN()>=INDIRECT(AQ20),IF(COLUMN()<=INDIRECT(AR20),INDIRECT(AS20),\"\"),\"\")","v":{"$error":"#N/A"}},{"$f":"IF(COLUMN()>=INDIRECT(AQ20),IF(COLUMN()<=INDIRECT(AR20),INDIRECT(AS20),\"\"),\"\")","v":{"$error":"#N/A"}},{"$f":"IF(COLUMN()>=INDIRECT(AQ20),IF(COLUMN()<=INDIRECT(AR20),INDIRECT(AS20),\"\"),\"\")","v":{"$error":"#N/A"}},{"$f":"IF(COLUMN()>=INDIRECT(AQ20),IF(COLUMN()<=INDIRECT(AR20),INDIRECT(AS20),\"\"),\"\")","v":{"$error":"#N/A"}},{"$f":"IF(COLUMN()>=INDIRECT(AQ20),IF(COLUMN()<=INDIRECT(AR20),INDIRECT(AS20),\"\"),\"\")","v":{"$error":"#N/A"}},{"$f":"IF(COLUMN()>=INDIRECT(AQ20),IF(COLUMN()<=INDIRECT(AR20),INDIRECT(AS20),\"\"),\"\")","v":{"$error":"#N/A"}},{"$f":"IF(COLUMN()>=INDIRECT(AQ20),IF(COLUMN()<=INDIRECT(AR20),INDIRECT(AS20),\"\"),\"\")","v":{"$error":"#N/A"}},{"$f":"IF(COLUMN()>=INDIRECT(AQ20),IF(COLUMN()<=INDIRECT(AR20),INDIRECT(AS20),\"\"),\"\")","v":{"$error":"#N/A"}},{"$f":"IF(COLUMN()>=INDIRECT(AQ20),IF(COLUMN()<=INDIRECT(AR20),INDIRECT(AS20),\"\"),\"\")","v":{"$error":"#N/A"}},{"$f":"IF(COLUMN()>=INDIRECT(AQ20),IF(COLUMN()<=INDIRECT(AR20),INDIRECT(AS20),\"\"),\"\")","v":{"$error":"#N/A"}},{"$f":"IF(COLUMN()>=INDIRECT(AQ20),IF(COLUMN()<=INDIRECT(AR20),INDIRECT(AS20),\"\"),\"\")","v":{"$error":"#N/A"}},{"$f":"IF(COLUMN()>=INDIRECT(AQ20),IF(COLUMN()<=INDIRECT(AR20),INDIRECT(AS20),\"\"),\"\")","v":{"$error":"#N/A"}},{"$f":"IF(COLUMN()>=INDIRECT(AQ20),IF(COLUMN()<=INDIRECT(AR20),INDIRECT(AS20),\"\"),\"\")","v":{"$error":"#N/A"}},{"$f":"IF(COLUMN()>=INDIRECT(AQ20),IF(COLUMN()<=INDIRECT(AR20),INDIRECT(AS20),\"\"),\"\")","v":{"$error":"#N/A"}},{"$f":"IF(COLUMN()>=INDIRECT(AQ20),IF(COLUMN()<=INDIRECT(AR20),INDIRECT(AS20),\"\"),\"\")","v":{"$error":"#N/A"}},{"$f":"IF(COLUMN()>=INDIRECT(AQ20),IF(COLUMN()<=INDIRECT(AR20),INDIRECT(AS20),\"\"),\"\")","v":{"$error":"#N/A"}},{"$f":"IF(COLUMN()>=INDIRECT(AQ20),IF(COLUMN()<=INDIRECT(AR20),INDIRECT(AS20),\"\"),\"\")","v":{"$error":"#N/A"}},{"$f":"IF(COLUMN()>=INDIRECT(AQ20),IF(COLUMN()<=INDIRECT(AR20),INDIRECT(AS20),\"\"),\"\")","v":{"$error":"#N/A"}},{"$f":"IF(COLUMN()>=INDIRECT(AQ20),IF(COLUMN()<=INDIRECT(AR20),INDIRECT(AS20),\"\"),\"\")","v":{"$error":"#N/A"}},{"$f":"IF(COLUMN()>=INDIRECT(AQ20),IF(COLUMN()<=INDIRECT(AR20),INDIRECT(AS20),\"\"),\"\")","v":{"$error":"#N/A"}},{"$f":"IF(COLUMN()>=INDIRECT(AQ20),IF(COLUMN()<=INDIRECT(AR20),INDIRECT(AS20),\"\"),\"\")","v":{"$error":"#N/A"}},{"$f":"IF(COLUMN()>=INDIRECT(AQ20),IF(COLUMN()<=INDIRECT(AR20),INDIRECT(AS20),\"\"),\"\")","v":{"$error":"#N/A"}},{"$f":"IF(COLUMN()>=INDIRECT(AQ20),IF(COLUMN()<=INDIRECT(AR20),INDIRECT(AS20),\"\"),\"\")","v":{"$error":"#N/A"}},{"$f":"IF(COLUMN()>=INDIRECT(AQ20),IF(COLUMN()<=INDIRECT(AR20),INDIRECT(AS20),\"\"),\"\")","v":{"$error":"#N/A"}},{"$f":"IF(COLUMN()>=INDIRECT(AQ20),IF(COLUMN()<=INDIRECT(AR20),INDIRECT(AS20),\"\"),\"\")","v":{"$error":"#N/A"}},{"$f":"IF(COLUMN()>=INDIRECT(AQ20),IF(COLUMN()<=INDIRECT(AR20),INDIRECT(AS20),\"\"),\"\")","v":{"$error":"#N/A"}},{"$f":"IF(COLUMN()>=INDIRECT(AQ20),IF(COLUMN()<=INDIRECT(AR20),INDIRECT(AS20),\"\"),\"\")","v":{"$error":"#N/A"}},{"$f":"IF(COLUMN()>=INDIRECT(AQ20),IF(COLUMN()<=INDIRECT(AR20),INDIRECT(AS20),\"\"),\"\")","v":{"$error":"#N/A"}},{"$f":"IF(COLUMN()>=INDIRECT(AQ20),IF(COLUMN()<=INDIRECT(AR20),INDIRECT(AS20),\"\"),\"\")","v":{"$error":"#N/A"}},{"$f":"IF(COLUMN()>=INDIRECT(AQ20),IF(COLUMN()<=INDIRECT(AR20),INDIRECT(AS20),\"\"),\"\")","v":{"$error":"#N/A"}},{"$f":"IF(COLUMN()>=INDIRECT(AQ20),IF(COLUMN()<=INDIRECT(AR20),INDIRECT(AS20),\"\"),\"\")","v":{"$error":"#N/A"}},{"$f":"IF(COLUMN()>=INDIRECT(AQ20),IF(COLUMN()<=INDIRECT(AR20),INDIRECT(AS20),\"\"),\"\")","v":{"$error":"#N/A"}},{"$f":"IF(COLUMN()>=INDIRECT(AQ20),IF(COLUMN()<=INDIRECT(AR20),INDIRECT(AS20),\"\"),\"\")","v":{"$error":"#N/A"}},{"$f":"IF(COLUMN()>=INDIRECT(AQ20),IF(COLUMN()<=INDIRECT(AR20),INDIRECT(AS20),\"\"),\"\")","v":{"$error":"#N/A"}},{"$f":"IF(COLUMN()>=INDIRECT(AQ20),IF(COLUMN()<=INDIRECT(AR20),INDIRECT(AS20),\"\"),\"\")","v":{"$error":"#N/A"}},{"$f":"IF(COLUMN()>=INDIRECT(AQ20),IF(COLUMN()<=INDIRECT(AR20),INDIRECT(AS20),\"\"),\"\")","v":{"$error":"#N/A"}},{"$f":"IF(COLUMN()>=INDIRECT(AQ20),IF(COLUMN()<=INDIRECT(AR20),INDIRECT(AS20),\"\"),\"\")","v":{"$error":"#N/A"}},null,{"$f":"CONCATENATE(\"'\",SUBSTITUTE(SUBSTITUTE(SUBSTITUTE(MID(CELL(\"direccion\",'ETAPA III.a'!M$1),FIND(\"]\",CELL(\"direccion\",'ETAPA III.a'!M$1))+1,LEN(CELL(\"direccion\",'ETAPA III.a'!M$1))),\"$\",\"\"),1,MATCH($A20,'ETAPA III.a'!$K:$K,0)),\"!\",\"!$\"))","v":"'ETAPA III.a'!$M72"},{"$f":"CONCATENATE(\"'\",SUBSTITUTE(SUBSTITUTE(SUBSTITUTE(MID(CELL(\"direccion\",'ETAPA III.a'!N$1),FIND(\"]\",CELL(\"direccion\",'ETAPA III.a'!N$1))+1,LEN(CELL(\"direccion\",'ETAPA III.a'!N$1))),\"$\",\"\"),1,MATCH($A20,'ETAPA III.a'!$K:$K,0)),\"!\",\"!$\"))","v":"'ETAPA III.a'!$N72"},{"$f":"CONCATENATE(\"'\",SUBSTITUTE(SUBSTITUTE(SUBSTITUTE(MID(CELL(\"direccion\",'ETAPA III.a'!L$1),FIND(\"]\",CELL(\"direccion\",'ETAPA III.a'!L$1))+1,LEN(CELL(\"direccion\",'ETAPA III.a'!L$1))),\"$\",\"\"),1,MATCH($A20,'ETAPA III.a'!$K:$K,0)),\"!\",\"!$\"))","v":"'ETAPA III.a'!$L72"}]
[11,{"$f":"IF(COLUMN()>=INDIRECT(AQ24),IF(COLUMN()<=INDIRECT(AR24),INDIRECT(AS24),\"\"),\"\")","v":{"$error":"#N/A"}},{"$f":"IF(COLUMN()>=INDIRECT(AQ24),IF(COLUMN()<=INDIRECT(AR24),INDIRECT(AS24),\"\"),\"\")","v":{"$error":"#N/A"}},{"$f":"IF(COLUMN()>=INDIRECT(AQ24),IF(COLUMN()<=INDIRECT(AR24),INDIRECT(AS24),\"\"),\"\")","v":{"$error":"#N/A"}},{"$f":"IF(COLUMN()>=INDIRECT(AQ24),IF(COLUMN()<=INDIRECT(AR24),INDIRECT(AS24),\"\"),\"\")","v":{"$error":"#N/A"}},{"$f":"IF(COLUMN()>=INDIRECT(AQ24),IF(COLUMN()<=INDIRECT(AR24),INDIRECT(AS24),\"\"),\"\")","v":{"$error":"#N/A"}},{"$f":"IF(COLUMN()>=INDIRECT(AQ24),IF(COLUMN()<=INDIRECT(AR24),INDIRECT(AS24),\"\"),\"\")","v":{"$error":"#N/A"}},{"$f":"IF(COLUMN()>=INDIRECT(AQ24),IF(COLUMN()<=INDIRECT(AR24),INDIRECT(AS24),\"\"),\"\")","v":{"$error":"#N/A"}},{"$f":"IF(COLUMN()>=INDIRECT(AQ24),IF(COLUMN()<=INDIRECT(AR24),INDIRECT(AS24),\"\"),\"\")","v":{"$error":"#N/A"}},{"$f":"IF(COLUMN()>=INDIRECT(AQ24),IF(COLUMN()<=INDIRECT(AR24),INDIRECT(AS24),\"\"),\"\")","v":{"$error":"#N/A"}},{"$f":"IF(COLUMN()>=INDIRECT(AQ24),IF(COLUMN()<=INDIRECT(AR24),INDIRECT(AS24),\"\"),\"\")","v":{"$error":"#N/A"}},{"$f":"IF(COLUMN()>=INDIRECT(AQ24),IF(COLUMN()<=INDIRECT(AR24),INDIRECT(AS24),\"\"),\"\")","v":{"$error":"#N/A"}},{"$f":"IF(COLUMN()>=INDIRECT(AQ24),IF(COLUMN()<=INDIRECT(AR24),INDIRECT(AS24),\"\"),\"\")","v":{"$error":"#N/A"}},{"$f":"IF(COLUMN()>=INDIRECT(AQ24),IF(COLUMN()<=INDIRECT(AR24),INDIRECT(AS24),\"\"),\"\")","v":{"$error":"#N/A"}},{"$f":"IF(COLUMN()>=INDIRECT(AQ24),IF(COLUMN()<=INDIRECT(AR24),INDIRECT(AS24),\"\"),\"\")","v":{"$error":"#N/A"}},{"$f":"IF(COLUMN()>=INDIRECT(AQ24),IF(COLUMN()<=INDIRECT(AR24),INDIRECT(AS24),\"\"),\"\")","v":{"$error":"#N/A"}},{"$f":"IF(COLUMN()>=INDIRECT(AQ24),IF(COLUMN()<=INDIRECT(AR24),INDIRECT(AS24),\"\"),\"\")","v":{"$error":"#N/A"}},{"$f":"IF(COLUMN()>=INDIRECT(AQ24),IF(COLUMN()<=INDIRECT(AR24),INDIRECT(AS24),\"\"),\"\")","v":{"$error":"#N/A"}},{"$f":"IF(COLUMN()>=INDIRECT(AQ24),IF(COLUMN()<=INDIRECT(AR24),INDIRECT(AS24),\"\"),\"\")","v":{"$error":"#N/A"}},{"$f":"IF(COLUMN()>=INDIRECT(AQ24),IF(COLUMN()<=INDIRECT(AR24),INDIRECT(AS24),\"\"),\"\")","v":{"$error":"#N/A"}},{"$f":"IF(COLUMN()>=INDIRECT(AQ24),IF(COLUMN()<=INDIRECT(AR24),INDIRECT(AS24),\"\"),\"\")","v":{"$error":"#N/A"}},{"$f":"IF(COLUMN()>=INDIRECT(AQ24),IF(COLUMN()<=INDIRECT(AR24),INDIRECT(AS24),\"\"),\"\")","v":{"$error":"#N/A"}},{"$f":"IF(COLUMN()>=INDIRECT(AQ24),IF(COLUMN()<=INDIRECT(AR24),INDIRECT(AS24),\"\"),\"\")","v":{"$error":"#N/A"}},{"$f":"IF(COLUMN()>=INDIRECT(AQ24),IF(COLUMN()<=INDIRECT(AR24),INDIRECT(AS24),\"\"),\"\")","v":{"$error":"#N/A"}},{"$f":"IF(COLUMN()>=INDIRECT(AQ24),IF(COLUMN()<=INDIRECT(AR24),INDIRECT(AS24),\"\"),\"\")","v":{"$error":"#N/A"}},{"$f":"IF(COLUMN()>=INDIRECT(AQ24),IF(COLUMN()<=INDIRECT(AR24),INDIRECT(AS24),\"\"),\"\")","v":{"$error":"#N/A"}},{"$f":"IF(COLUMN()>=INDIRECT(AQ24),IF(COLUMN()<=INDIRECT(AR24),INDIRECT(AS24),\"\"),\"\")","v":{"$error":"#N/A"}},{"$f":"IF(COLUMN()>=INDIRECT(AQ24),IF(COLUMN()<=INDIRECT(AR24),INDIRECT(AS24),\"\"),\"\")","v":{"$error":"#N/A"}},{"$f":"IF(COLUMN()>=INDIRECT(AQ24),IF(COLUMN()<=INDIRECT(AR24),INDIRECT(AS24),\"\"),\"\")","v":{"$error":"#N/A"}},{"$f":"IF(COLUMN()>=INDIRECT(AQ24),IF(COLUMN()<=INDIRECT(AR24),INDIRECT(AS24),\"\"),\"\")","v":{"$error":"#N/A"}},{"$f":"IF(COLUMN()>=INDIRECT(AQ24),IF(COLUMN()<=INDIRECT(AR24),INDIRECT(AS24),\"\"),\"\")","v":{"$error":"#N/A"}},{"$f":"IF(COLUMN()>=INDIRECT(AQ24),IF(COLUMN()<=INDIRECT(AR24),INDIRECT(AS24),\"\"),\"\")","v":{"$error":"#N/A"}},{"$f":"IF(COLUMN()>=INDIRECT(AQ24),IF(COLUMN()<=INDIRECT(AR24),INDIRECT(AS24),\"\"),\"\")","v":{"$error":"#N/A"}},{"$f":"IF(COLUMN()>=INDIRECT(AQ24),IF(COLUMN()<=INDIRECT(AR24),INDIRECT(AS24),\"\"),\"\")","v":{"$error":"#N/A"}},{"$f":"IF(COLUMN()>=INDIRECT(AQ24),IF(COLUMN()<=INDIRECT(AR24),INDIRECT(AS24),\"\"),\"\")","v":{"$error":"#N/A"}},{"$f":"IF(COLUMN()>=INDIRECT(AQ24),IF(COLUMN()<=INDIRECT(AR24),INDIRECT(AS24),\"\"),\"\")","v":{"$error":"#N/A"}},{"$f":"IF(COLUMN()>=INDIRECT(AQ24),IF(COLUMN()<=INDIRECT(AR24),INDIRECT(AS24),\"\"),\"\")","v":{"$error":"#N/A"}},{"$f":"IF(COLUMN()>=INDIRECT(AQ24),IF(COLUMN()<=INDIRECT(AR24),INDIRECT(AS24),\"\"),\"\")","v":{"$error":"#N/A"}},{"$f":"IF(COLUMN()>=INDIRECT(AQ24),IF(COLUMN()<=INDIRECT(AR24),INDIRECT(AS24),\"\"),\"\")","v":{"$error":"#N/A"}},{"$f":"IF(COLUMN()>=INDIRECT(AQ24),IF(COLUMN()<=INDIRECT(AR24),INDIRECT(AS24),\"\"),\"\")","v":{"$error":"#N/A"}},{"$f":"IF(COLUMN()>=INDIRECT(AQ24),IF(COLUMN()<=INDIRECT(AR24),INDIRECT(AS24),\"\"),\"\")","v":{"$error":"#N/A"}},null,{"$f":"CONCATENATE(\"'\",SUBSTITUTE(SUBSTITUTE(SUBSTITUTE(MID(CELL(\"direccion\",'ETAPA III.a'!M$1),FIND(\"]\",CELL(\"direccion\",'ETAPA III.a'!M$1))+1,LEN(CELL(\"direccion\",'ETAPA III.a'!M$1))),\"$\",\"\"),1,MATCH($A21,'ETAPA III.a'!$K:$K,0)),\"!\",\"!$\"))","v":"'ETAPA III.a'!$M79"},{"$f":"CONCATENATE(\"'\",SUBSTITUTE(SUBSTITUTE(SUBSTITUTE(MID(CELL(\"direccion\",'ETAPA III.a'!N$1),FIND(\"]\",CELL(\"direccion\",'ETAPA III.a'!N$1))+1,LEN(CELL(\"direccion\",'ETAPA III.a'!N$1))),\"$\",\"\"),1,MATCH($A21,'ETAPA III.a'!$K:$K,0)),\"!\",\"!$\"))","v":"'ETAPA III.a'!$N79"},{"$f":"CONCATENATE(\"'\",SUBSTITUTE(SUBSTITUTE(SUBSTITUTE(MID(CELL(\"direccion\",'ETAPA III.a'!L$1),FIND(\"]\",CELL(\"direccion\",'ETAPA III.a'!L$1))+1,LEN(CELL(\"direccion\",'ETAPA III.a'!L$1))),\"$\",\"\"),1,MATCH($A21,'ETAPA III.a'!$K:$K,0)),\"!\",\"!$\"))","v":"'ETAPA III.a'!$L79"}]
[12,{"$f":"IF(COLUMN()>=INDIRECT(AQ25),IF(COLUMN()<=INDIRECT(AR25),INDIRECT(AS25),\"\"),\"\")","v":{"$error":"#N/A"}},{"$f":"IF(COLUMN()>=INDIRECT(AQ25),IF(COLUMN()<=INDIRECT(AR25),INDIRECT(AS25),\"\"),\"\")","v":{"$error":"#N/A"}},{"$f":"IF(COLUMN()>=INDIRECT(AQ25),IF(COLUMN()<=INDIRECT(AR25),INDIRECT(AS25),\"\"),\"\")","v":{"$error":"#N/A"}},{"$f":"IF(COLUMN()>=INDIRECT(AQ25),IF(COLUMN()<=INDIRECT(AR25),INDIRECT(AS25),\"\"),\"\")","v":{"$error":"#N/A"}},{"$f":"IF(COLUMN()>=INDIRECT(AQ25),IF(COLUMN()<=INDIRECT(AR25),INDIRECT(AS25),\"\"),\"\")","v":{"$error":"#N/A"}},{"$f":"IF(COLUMN()>=INDIRECT(AQ25),IF(COLUMN()<=INDIRECT(AR25),INDIRECT(AS25),\"\"),\"\")","v":{"$error":"#N/A"}},{"$f":"IF(COLUMN()>=INDIRECT(AQ25),IF(COLUMN()<=INDIRECT(AR25),INDIRECT(AS25),\"\"),\"\")","v":{"$error":"#N/A"}},{"$f":"IF(COLUMN()>=INDIRECT(AQ25),IF(COLUMN()<=INDIRECT(AR25),INDIRECT(AS25),\"\"),\"\")","v":{"$error":"#N/A"}},{"$f":"IF(COLUMN()>=INDIRECT(AQ25),IF(COLUMN()<=INDIRECT(AR25),INDIRECT(AS25),\"\"),\"\")","v":{"$error":"#N/A"}},{"$f":"IF(COLUMN()>=INDIRECT(AQ25),IF(COLUMN()<=INDIRECT(AR25),INDIRECT(AS25),\"\"),\"\")","v":{"$error":"#N/A"}},{"$f":"IF(COLUMN()>=INDIRECT(AQ25),IF(COLUMN()<=INDIRECT(AR25),INDIRECT(AS25),\"\"),\"\")","v":{"$error":"#N/A"}},{"$f":"IF(COLUMN()>=INDIRECT(AQ25),IF(COLUMN()<=INDIRECT(AR25),INDIRECT(AS25),\"\"),\"\")","v":{"$error":"#N/A"}},{"$f":"IF(COLUMN()>=INDIRECT(AQ25),IF(COLUMN()<=INDIRECT(AR25),INDIRECT(AS25),\"\"),\"\")","v":{"$error":"#N/A"}},{"$f":"IF(COLUMN()>=INDIRECT(AQ25),IF(COLUMN()<=INDIRECT(AR25),INDIRECT(AS25),\"\"),\"\")","v":{"$error":"#N/A"}},{"$f":"IF(COLUMN()>=INDIRECT(AQ25),IF(COLUMN()<=INDIRECT(AR25),INDIRECT(AS25),\"\"),\"\")","v":{"$error":"#N/A"}},{"$f":"IF(COLUMN()>=INDIRECT(AQ25),IF(COLUMN()<=INDIRECT(AR25),INDIRECT(AS25),\"\"),\"\")","v":{"$error":"#N/A"}},{"$f":"IF(COLUMN()>=INDIRECT(AQ25),IF(COLUMN()<=INDIRECT(AR25),INDIRECT(AS25),\"\"),\"\")","v":{"$error":"#N/A"}},{"$f":"IF(COLUMN()>=INDIRECT(AQ25),IF(COLUMN()<=INDIRECT(AR25),INDIRECT(AS25),\"\"),\"\")","v":{"$error":"#N/A"}},{"$f":"IF(COLUMN()>=INDIRECT(AQ25),IF(COLUMN()<=INDIRECT(AR25),INDIRECT(AS25),\"\"),\"\")","v":{"$error":"#N/A"}},{"$f":"IF(COLUMN()>=INDIRECT(AQ25),IF(COLUMN()<=INDIRECT(AR25),INDIRECT(AS25),\"\"),\"\")","v":{"$error":"#N/A"}},{"$f":"IF(COLUMN()>=INDIRECT(AQ25),IF(COLUMN()<=INDIRECT(AR25),INDIRECT(AS25),\"\"),\"\")","v":{"$error":"#N/A"}},{"$f":"IF(COLUMN()>=INDIRECT(AQ25),IF(COLUMN()<=INDIRECT(AR25),INDIRECT(AS25),\"\"),\"\")","v":{"$error":"#N/A"}},{"$f":"IF(COLUMN()>=INDIRECT(AQ25),IF(COLUMN()<=INDIRECT(AR25),INDIRECT(AS25),\"\"),\"\")","v":{"$error":"#N/A"}},{"$f":"IF(COLUMN()>=INDIRECT(AQ25),IF(COLUMN()<=INDIRECT(AR25),INDIRECT(AS25),\"\"),\"\")","v":{"$error":"#N/A"}},{"$f":"IF(COLUMN()>=INDIRECT(AQ25),IF(COLUMN()<=INDIRECT(AR25),INDIRECT(AS25),\"\"),\"\")","v":{"$error":"#N/A"}},{"$f":"IF(COLUMN()>=INDIRECT(AQ25),IF(COLUMN()<=INDIRECT(AR25),INDIRECT(AS25),\"\"),\"\")","v":{"$error":"#N/A"}},{"$f":"IF(COLUMN()>=INDIRECT(AQ25),IF(COLUMN()<=INDIRECT(AR25),INDIRECT(AS25),\"\"),\"\")","v":{"$error":"#N/A"}},{"$f":"IF(COLUMN()>=INDIRECT(AQ25),IF(COLUMN()<=INDIRECT(AR25),INDIRECT(AS25),\"\"),\"\")","v":{"$error":"#N/A"}},{"$f":"IF(COLUMN()>=INDIRECT(AQ25),IF(COLUMN()<=INDIRECT(AR25),INDIRECT(AS25),\"\"),\"\")","v":{"$error":"#N/A"}},{"$f":"IF(COLUMN()>=INDIRECT(AQ25),IF(COLUMN()<=INDIRECT(AR25),INDIRECT(AS25),\"\"),\"\")","v":{"$error":"#N/A"}},{"$f":"IF(COLUMN()>=INDIRECT(AQ25),IF(COLUMN()<=INDIRECT(AR25),INDIRECT(AS25),\"\"),\"\")","v":{"$error":"#N/A"}},{"$f":"IF(COLUMN()>=INDIRECT(AQ25),IF(COLUMN()<=INDIRECT(AR25),INDIRECT(AS25),\"\"),\"\")","v":{"$error":"#N/A"}},{"$f":"IF(COLUMN()>=INDIRECT(AQ25),IF(COLUMN()<=INDIRECT(AR25),INDIRECT(AS25),\"\"),\"\")","v":{"$error":"#N/A"}},{"$f":"IF(COLUMN()>=INDIRECT(AQ25),IF(COLUMN()<=INDIRECT(AR25),INDIRECT(AS25),\"\"),\"\")","v":{"$error":"#N/A"}},{"$f":"IF(COLUMN()>=INDIRECT(AQ25),IF(COLUMN()<=INDIRECT(AR25),INDIRECT(AS25),\"\"),\"\")","v":{"$error":"#N/A"}},{"$f":"IF(COLUMN()>=INDIRECT(AQ25),IF(COLUMN()<=INDIRECT(AR25),INDIRECT(AS25),\"\"),\"\")","v":{"$error":"#N/A"}},{"$f":"IF(COLUMN()>=INDIRECT(AQ25),IF(COLUMN()<=INDIRECT(AR25),INDIRECT(AS25),\"\"),\"\")","v":{"$error":"#N/A"}},{"$f":"IF(COLUMN()>=INDIRECT(AQ25),IF(COLUMN()<=INDIRECT(AR25),INDIRECT(AS25),\"\"),\"\")","v":{"$error":"#N/A"}},{"$f":"IF(COLUMN()>=INDIRECT(AQ25),IF(COLUMN()<=INDIRECT(AR25),INDIRECT(AS25),\"\"),\"\")","v":{"$error":"#N/A"}},{"$f":"IF(COLUMN()>=INDIRECT(AQ25),IF(COLUMN()<=INDIRECT(AR25),INDIRECT(AS25),\"\"),\"\")","v":{"$error":"#N/A"}},null,{"$f":"CONCATENATE(\"'\",SUBSTITUTE(SUBSTITUTE(SUBSTITUTE(MID(CELL(\"direccion\",'ETAPA III.a'!M$1),FIND(\"]\",CELL(\"direccion\",'ETAPA III.a'!M$1))+1,LEN(CELL(\"direccion\",'ETAPA III.a'!M$1))),\"$\",\"\"),1,MATCH($A22,'ETAPA III.a'!$K:$K,0)),\"!\",\"!$\"))","v":"'ETAPA III.a'!$M86"},{"$f":"CONCATENATE(\"'\",SUBSTITUTE(SUBSTITUTE(SUBSTITUTE(MID(CELL(\"direccion\",'ETAPA III.a'!N$1),FIND(\"]\",CELL(\"direccion\",'ETAPA III.a'!N$1))+1,LEN(CELL(\"direccion\",'ETAPA III.a'!N$1))),\"$\",\"\"),1,MATCH($A22,'ETAPA III.a'!$K:$K,0)),\"!\",\"!$\"))","v":"'ETAPA III.a'!$N86"},{"$f":"CONCATENATE(\"'\",SUBSTITUTE(SUBSTITUTE(SUBSTITUTE(MID(CELL(\"direccion\",'ETAPA III.a'!L$1),FIND(\"]\",CELL(\"direccion\",'ETAPA III.a'!L$1))+1,LEN(CELL(\"direccion\",'ETAPA III.a'!L$1))),\"$\",\"\"),1,MATCH($A22,'ETAPA III.a'!$K:$K,0)),\"!\",\"!$\"))","v":"'ETAPA III.a'!$L86"}]
[13,{"$f":"IF(COLUMN()>=INDIRECT(AQ26),IF(COLUMN()<=INDIRECT(AR26),INDIRECT(AS26),\"\"),\"\")","v":{"$error":"#N/A"}},{"$f":"IF(COLUMN()>=INDIRECT(AQ26),IF(COLUMN()<=INDIRECT(AR26),INDIRECT(AS26),\"\"),\"\")","v":{"$error":"#N/A"}},{"$f":"IF(COLUMN()>=INDIRECT(AQ26),IF(COLUMN()<=INDIRECT(AR26),INDIRECT(AS26),\"\"),\"\")","v":{"$error":"#N/A"}},{"$f":"IF(COLUMN()>=INDIRECT(AQ26),IF(COLUMN()<=INDIRECT(AR26),INDIRECT(AS26),\"\"),\"\")","v":{"$error":"#N/A"}},{"$f":"IF(COLUMN()>=INDIRECT(AQ26),IF(COLUMN()<=INDIRECT(AR26),INDIRECT(AS26),\"\"),\"\")","v":{"$error":"#N/A"}},{"$f":"IF(COLUMN()>=INDIRECT(AQ26),IF(COLUMN()<=INDIRECT(AR26),INDIRECT(AS26),\"\"),\"\")","v":{"$error":"#N/A"}},{"$f":"IF(COLUMN()>=INDIRECT(AQ26),IF(COLUMN()<=INDIRECT(AR26),INDIRECT(AS26),\"\"),\"\")","v":{"$error":"#N/A"}},{"$f":"IF(COLUMN()>=INDIRECT(AQ26),IF(COLUMN()<=INDIRECT(AR26),INDIRECT(AS26),\"\"),\"\")","v":{"$error":"#N/A"}},{"$f":"IF(COLUMN()>=INDIRECT(AQ26),IF(COLUMN()<=INDIRECT(AR26),INDIRECT(AS26),\"\"),\"\")","v":{"$error":"#N/A"}},{"$f":"IF(COLUMN()>=INDIRECT(AQ26),IF(COLUMN()<=INDIRECT(AR26),INDIRECT(AS26),\"\"),\"\")","v":{"$error":"#N/A"}},{"$f":"IF(COLUMN()>=INDIRECT(AQ26),IF(COLUMN()<=INDIRECT(AR26),INDIRECT(AS26),\"\"),\"\")","v":{"$error":"#N/A"}},{"$f":"IF(COLUMN()>=INDIRECT(AQ26),IF(COLUMN()<=INDIRECT(AR26),INDIRECT(AS26),\"\"),\"\")","v":{"$error":"#N/A"}},{"$f":"IF(COLUMN()>=INDIRECT(AQ26),IF(COLUMN()<=INDIRECT(AR26),INDIRECT(AS26),\"\"),\"\")","v":{"$error":"#N/A"}},{"$f":"IF(COLUMN()>=INDIRECT(AQ26),IF(COLUMN()<=INDIRECT(AR26),INDIRECT(AS26),\"\"),\"\")","v":{"$error":"#N/A"}},{"$f":"IF(COLUMN()>=INDIRECT(AQ26),IF(COLUMN()<=INDIRECT(AR26),INDIRECT(AS26),\"\"),\"\")","v":{"$error":"#N/A"}},{"$f":"IF(COLUMN()>=INDIRECT(AQ26),IF(COLUMN()<=INDIRECT(AR26),INDIRECT(AS26),\"\"),\"\")","v":{"$error":"#N/A"}},{"$f":"IF(COLUMN()>=INDIRECT(AQ26),IF(COLUMN()<=INDIRECT(AR26),INDIRECT(AS26),\"\"),\"\")","v":{"$error":"#N/A"}},{"$f":"IF(COLUMN()>=INDIRECT(AQ26),IF(COLUMN()<=INDIRECT(AR26),INDIRECT(AS26),\"\"),\"\")","v":{"$error":"#N/A"}},{"$f":"IF(COLUMN()>=INDIRECT(AQ26),IF(COLUMN()<=INDIRECT(AR26),INDIRECT(AS26),\"\"),\"\")","v":{"$error":"#N/A"}},{"$f":"IF(COLUMN()>=INDIRECT(AQ26),IF(COLUMN()<=INDIRECT(AR26),INDIRECT(AS26),\"\"),\"\")","v":{"$error":"#N/A"}},{"$f":"IF(COLUMN()>=INDIRECT(AQ26),IF(COLUMN()<=INDIRECT(AR26),INDIRECT(AS26),\"\"),\"\")","v":{"$error":"#N/A"}},{"$f":"IF(COLUMN()>=INDIRECT(AQ26),IF(COLUMN()<=INDIRECT(AR26),INDIRECT(AS26),\"\"),\"\")","v":{"$error":"#N/A"}},{"$f":"IF(COLUMN()>=INDIRECT(AQ26),IF(COLUMN()<=INDIRECT(AR26),INDIRECT(AS26),\"\"),\"\")","v":{"$error":"#N/A"}},{"$f":"IF(COLUMN()>=INDIRECT(AQ26),IF(COLUMN()<=INDIRECT(AR26),INDIRECT(AS26),\"\"),\"\")","v":{"$error":"#N/A"}},{"$f":"IF(COLUMN()>=INDIRECT(AQ26),IF(COLUMN()<=INDIRECT(AR26),INDIRECT(AS26),\"\"),\"\")","v":{"$error":"#N/A"}},{"$f":"IF(COLUMN()>=INDIRECT(AQ26),IF(COLUMN()<=INDIRECT(AR26),INDIRECT(AS26),\"\"),\"\")","v":{"$error":"#N/A"}},{"$f":"IF(COLUMN()>=INDIRECT(AQ26),IF(COLUMN()<=INDIRECT(AR26),INDIRECT(AS26),\"\"),\"\")","v":{"$error":"#N/A"}},{"$f":"IF(COLUMN()>=INDIRECT(AQ26),IF(COLUMN()<=INDIRECT(AR26),INDIRECT(AS26),\"\"),\"\")","v":{"$error":"#N/A"}},{"$f":"IF(COLUMN()>=INDIRECT(AQ26),IF(COLUMN()<=INDIRECT(AR26),INDIRECT(AS26),\"\"),\"\")","v":{"$error":"#N/A"}},{"$f":"IF(COLUMN()>=INDIRECT(AQ26),IF(COLUMN()<=INDIRECT(AR26),INDIRECT(AS26),\"\"),\"\")","v":{"$error":"#N/A"}},{"$f":"IF(COLUMN()>=INDIRECT(AQ26),IF(COLUMN()<=INDIRECT(AR26),INDIRECT(AS26),\"\"),\"\")","v":{"$error":"#N/A"}},{"$f":"IF(COLUMN()>=INDIRECT(AQ26),IF(COLUMN()<=INDIRECT(AR26),INDIRECT(AS26),\"\"),\"\")","v":{"$error":"#N/A"}},{"$f":"IF(COLUMN()>=INDIRECT(AQ26),IF(COLUMN()<=INDIRECT(AR26),INDIRECT(AS26),\"\"),\"\")","v":{"$error":"#N/A"}},{"$f":"IF(COLUMN()>=INDIRECT(AQ26),IF(COLUMN()<=INDIRECT(AR26),INDIRECT(AS26),\"\"),\"\")","v":{"$error":"#N/A"}},{"$f":"IF(COLUMN()>=INDIRECT(AQ26),IF(COLUMN()<=INDIRECT(AR26),INDIRECT(AS26),\"\"),\"\")","v":{"$error":"#N/A"}},{"$f":"IF(COLUMN()>=INDIRECT(AQ26),IF(COLUMN()<=INDIRECT(AR26),INDIRECT(AS26),\"\"),\"\")","v":{"$error":"#N/A"}},{"$f":"IF(COLUMN()>=INDIRECT(AQ26),IF(COLUMN()<=INDIRECT(AR26),INDIRECT(AS26),\"\"),\"\")","v":{"$error":"#N/A"}},{"$f":"IF(COLUMN()>=INDIRECT(AQ26),IF(COLUMN()<=INDIRECT(AR26),INDIRECT(AS26),\"\"),\"\")","v":{"$error":"#N/A"}},{"$f":"IF(COLUMN()>=INDIRECT(AQ26),IF(COLUMN()<=INDIRECT(AR26),INDIRECT(AS26),\"\"),\"\")","v":{"$error":"#N/A"}},{"$f":"IF(COLUMN()>=INDIRECT(AQ26),IF(COLUMN()<=INDIRECT(AR26),INDIRECT(AS26),\"\"),\"\")","v":{"$error":"#N/A"}},null,{"$f":"CONCATENATE(\"'\",SUBSTITUTE(SUBSTITUTE(SUBSTITUTE(MID(CELL(\"direccion\",'ETAPA III.a'!M$1),FIND(\"]\",CELL(\"direccion\",'ETAPA III.a'!M$1))+1,LEN(CELL(\"direccion\",'ETAPA III.a'!M$1))),\"$\",\"\"),1,MATCH($A23,'ETAPA III.a'!$K:$K,0)),\"!\",\"!$\"))","v":"'ETAPA III.a'!$M96"},{"$f":"CONCATENATE(\"'\",SUBSTITUTE(SUBSTITUTE(SUBSTITUTE(MID(CELL(\"direccion\",'ETAPA III.a'!N$1),FIND(\"]\",CELL(\"direccion\",'ETAPA III.a'!N$1))+1,LEN(CELL(\"direccion\",'ETAPA III.a'!N$1))),\"$\",\"\"),1,MATCH($A23,'ETAPA III.a'!$K:$K,0)),\"!\",\"!$\"))","v":"'ETAPA III.a'!$N96"},{"$f":"CONCATENATE(\"'\",SUBSTITUTE(SUBSTITUTE(SUBSTITUTE(MID(CELL(\"direccion\",'ETAPA III.a'!L$1),FIND(\"]\",CELL(\"direccion\",'ETAPA III.a'!L$1))+1,LEN(CELL(\"direccion\",'ETAPA III.a'!L$1))),\"$\",\"\"),1,MATCH($A23,'ETAPA III.a'!$K:$K,0)),\"!\",\"!$\"))","v":"'ETAPA III.a'!$L96"}]
[14,{"$f":"IF(COLUMN()>=INDIRECT(AQ27),IF(COLUMN()<=INDIRECT(AR27),INDIRECT(AS27),\"\"),\"\")","v":{"$error":"#N/A"}},{"$f":"IF(COLUMN()>=INDIRECT(AQ27),IF(COLUMN()<=INDIRECT(AR27),INDIRECT(AS27),\"\"),\"\")","v":{"$error":"#N/A"}},{"$f":"IF(COLUMN()>=INDIRECT(AQ27),IF(COLUMN()<=INDIRECT(AR27),INDIRECT(AS27),\"\"),\"\")","v":{"$error":"#N/A"}},{"$f":"IF(COLUMN()>=INDIRECT(AQ27),IF(COLUMN()<=INDIRECT(AR27),INDIRECT(AS27),\"\"),\"\")","v":{"$error":"#N/A"}},{"$f":"IF(COLUMN()>=INDIRECT(AQ27),IF(COLUMN()<=INDIRECT(AR27),INDIRECT(AS27),\"\"),\"\")","v":{"$error":"#N/A"}},{"$f":"IF(COLUMN()>=INDIRECT(AQ27),IF(COLUMN()<=INDIRECT(AR27),INDIRECT(AS27),\"\"),\"\")","v":{"$error":"#N/A"}},{"$f":"IF(COLUMN()>=INDIRECT(AQ27),IF(COLUMN()<=INDIRECT(AR27),INDIRECT(AS27),\"\"),\"\")","v":{"$error":"#N/A"}},{"$f":"IF(COLUMN()>=INDIRECT(AQ27),IF(COLUMN()<=INDIRECT(AR27),INDIRECT(AS27),\"\"),\"\")","v":{"$error":"#N/A"}},{"$f":"IF(COLUMN()>=INDIRECT(AQ27),IF(COLUMN()<=INDIRECT(AR27),INDIRECT(AS27),\"\"),\"\")","v":{"$error":"#N/A"}},{"$f":"IF(COLUMN()>=INDIRECT(AQ27),IF(COLUMN()<=INDIRECT(AR27),INDIRECT(AS27),\"\"),\"\")","v":{"$error":"#N/A"}},{"$f":"IF(COLUMN()>=INDIRECT(AQ27),IF(COLUMN()<=INDIRECT(AR27),INDIRECT(AS27),\"\"),\"\")","v":{"$error":"#N/A"}},{"$f":"IF(COLUMN()>=INDIRECT(AQ27),IF(COLUMN()<=INDIRECT(AR27),INDIRECT(AS27),\"\"),\"\")","v":{"$error":"#N/A"}},{"$f":"IF(COLUMN()>=INDIRECT(AQ27),IF(COLUMN()<=INDIRECT(AR27),INDIRECT(AS27),\"\"),\"\")","v":{"$error":"#N/A"}},{"$f":"IF(COLUMN()>=INDIRECT(AQ27),IF(COLUMN()<=INDIRECT(AR27),INDIRECT(AS27),\"\"),\"\")","v":{"$error":"#N/A"}},{"$f":"IF(COLUMN()>=INDIRECT(AQ27),IF(COLUMN()<=INDIRECT(AR27),INDIRECT(AS27),\"\"),\"\")","v":{"$error":"#N/A"}},{"$f":"IF(COLUMN()>=INDIRECT(AQ27),IF(COLUMN()<=INDIRECT(AR27),INDIRECT(AS27),\"\"),\"\")","v":{"$error":"#N/A"}},{"$f":"IF(COLUMN()>=INDIRECT(AQ27),IF(COLUMN()<=INDIRECT(AR27),INDIRECT(AS27),\"\"),\"\")","v":{"$error":"#N/A"}},{"$f":"IF(COLUMN()>=INDIRECT(AQ27),IF(COLUMN()<=INDIRECT(AR27),INDIRECT(AS27),\"\"),\"\")","v":{"$error":"#N/A"}},{"$f":"IF(COLUMN()>=INDIRECT(AQ27),IF(COLUMN()<=INDIRECT(AR27),INDIRECT(AS27),\"\"),\"\")","v":{"$error":"#N/A"}},{"$f":"IF(COLUMN()>=INDIRECT(AQ27),IF(COLUMN()<=INDIRECT(AR27),INDIRECT(AS27),\"\"),\"\")","v":{"$error":"#N/A"}},{"$f":"IF(COLUMN()>=INDIRECT(AQ27),IF(COLUMN()<=INDIRECT(AR27),INDIRECT(AS27),\"\"),\"\")","v":{"$error":"#N/A"}},{"$f":"IF(COLUMN()>=INDIRECT(AQ27),IF(COLUMN()<=INDIRECT(AR27),INDIRECT(AS27),\"\"),\"\")","v":{"$error":"#N/A"}},{"$f":"IF(COLUMN()>=INDIRECT(AQ27),IF(COLUMN()<=INDIRECT(AR27),INDIRECT(AS27),\"\"),\"\")","v":{"$error":"#N/A"}},{"$f":"IF(COLUMN()>=INDIRECT(AQ27),IF(COLUMN()<=INDIRECT(AR27),INDIRECT(AS27),\"\"),\"\")","v":{"$error":"#N/A"}},{"$f":"IF(COLUMN()>=INDIRECT(AQ27),IF(COLUMN()<=INDIRECT(AR27),INDIRECT(AS27),\"\"),\"\")","v":{"$error":"#N/A"}},{"$f":"IF(COLUMN()>=INDIRECT(AQ27),IF(COLUMN()<=INDIRECT(AR27),INDIRECT(AS27),\"\"),\"\")","v":{"$error":"#N/A"}},{"$f":"IF(COLUMN()>=INDIRECT(AQ27),IF(COLUMN()<=INDIRECT(AR27),INDIRECT(AS27),\"\"),\"\")","v":{"$error":"#N/A"}},{"$f":"IF(COLUMN()>=INDIRECT(AQ27),IF(COLUMN()<=INDIRECT(AR27),INDIRECT(AS27),\"\"),\"\")","v":{"$error":"#N/A"}},{"$f":"IF(COLUMN()>=INDIRECT(AQ27),IF(COLUMN()<=INDIRECT(AR27),INDIRECT(AS27),\"\"),\"\")","v":{"$error":"#N/A"}},{"$f":"IF(COLUMN()>=INDIRECT(AQ27),IF(COLUMN()<=INDIRECT(AR27),INDIRECT(AS27),\"\"),\"\")","v":{"$error":"#N/A"}},{"$f":"IF(COLUMN()>=INDIRECT(AQ27),IF(COLUMN()<=INDIRECT(AR27),INDIRECT(AS27),\"\"),\"\")","v":{"$error":"#N/A"}},{"$f":"IF(COLUMN()>=INDIRECT(AQ27),IF(COLUMN()<=INDIRECT(AR27),INDIRECT(AS27),\"\"),\"\")","v":{"$error":"#N/A"}},{"$f":"IF(COLUMN()>=INDIRECT(AQ27),IF(COLUMN()<=INDIRECT(AR27),INDIRECT(AS27),\"\"),\"\")","v":{"$error":"#N/A"}},{"$f":"IF(COLUMN()>=INDIRECT(AQ27),IF(COLUMN()<=INDIRECT(AR27),INDIRECT(AS27),\"\"),\"\")","v":{"$error":"#N/A"}},{"$f":"IF(COLUMN()>=INDIRECT(AQ27),IF(COLUMN()<=INDIRECT(AR27),INDIRECT(AS27),\"\"),\"\")","v":{"$error":"#N/A"}},{"$f":"IF(COLUMN()>=INDIRECT(AQ27),IF(COLUMN()<=INDIRECT(AR27),INDIRECT(AS27),\"\"),\"\")","v":{"$error":"#N/A"}},{"$f":"IF(COLUMN()>=INDIRECT(AQ27),IF(COLUMN()<=INDIRECT(AR27),INDIRECT(AS27),\"\"),\"\")","v":{"$error":"#N/A"}},{"$f":"IF(COLUMN()>=INDIRECT(AQ27),IF(COLUMN()<=INDIRECT(AR27),INDIRECT(AS27),\"\"),\"\")","v":{"$error":"#N/A"}},{"$f":"IF(COLUMN()>=INDIRECT(AQ27),IF(COLUMN()<=INDIRECT(AR27),INDIRECT(AS27),\"\"),\"\")","v":{"$error":"#N/A"}},{"$f":"IF(COLUMN()>=INDIRECT(AQ27),IF(COLUMN()<=INDIRECT(AR27),INDIRECT(AS27),\"\"),\"\")","v":{"$error":"#N/A"}},null,{"$f":"CONCATENATE(\"'\",SUBSTITUTE(SUBSTITUTE(SUBSTITUTE(MID(CELL(\"direccion\",'ETAPA III.a'!M$1),FIND(\"]\",CELL(\"direccion\",'ETAPA III.a'!M$1))+1,LEN(CELL(\"direccion\",'ETAPA III.a'!M$1))),\"$\",\"\"),1,MATCH($A24,'ETAPA III.a'!$K:$K,0)),\"!\",\"!$\"))","v":"'ETAPA III.a'!$M103"},{"$f":"CONCATENATE(\"'\",SUBSTITUTE(SUBSTITUTE(SUBSTITUTE(MID(CELL(\"direccion\",'ETAPA III.a'!N$1),FIND(\"]\",CELL(\"direccion\",'ETAPA III.a'!N$1))+1,LEN(CELL(\"direccion\",'ETAPA III.a'!N$1))),\"$\",\"\"),1,MATCH($A24,'ETAPA III.a'!$K:$K,0)),\"!\",\"!$\"))","v":"'ETAPA III.a'!$N103"},{"$f":"CONCATENATE(\"'\",SUBSTITUTE(SUBSTITUTE(SUBSTITUTE(MID(CELL(\"direccion\",'ETAPA III.a'!L$1),FIND(\"]\",CELL(\"direccion\",'ETAPA III.a'!L$1))+1,LEN(CELL(\"direccion\",'ETAPA III.a'!L$1))),\"$\",\"\"),1,MATCH($A24,'ETAPA III.a'!$K:$K,0)),\"!\",\"!$\"))","v":"'ETAPA III.a'!$L103"}]
[15,{"$f":"IF(COLUMN()>=INDIRECT(AQ28),IF(COLUMN()<=INDIRECT(AR28),INDIRECT(AS28),\"\"),\"\")","v":{"$error":"#N/A"}},{"$f":"IF(COLUMN()>=INDIRECT(AQ28),IF(COLUMN()<=INDIRECT(AR28),INDIRECT(AS28),\"\"),\"\")","v":{"$error":"#N/A"}},{"$f":"IF(COLUMN()>=INDIRECT(AQ28),IF(COLUMN()<=INDIRECT(AR28),INDIRECT(AS28),\"\"),\"\")","v":{"$error":"#N/A"}},{"$f":"IF(COLUMN()>=INDIRECT(AQ28),IF(COLUMN()<=INDIRECT(AR28),INDIRECT(AS28),\"\"),\"\")","v":{"$error":"#N/A"}},{"$f":"IF(COLUMN()>=INDIRECT(AQ28),IF(COLUMN()<=INDIRECT(AR28),INDIRECT(AS28),\"\"),\"\")","v":{"$error":"#N/A"}},{"$f":"IF(COLUMN()>=INDIRECT(AQ28),IF(COLUMN()<=INDIRECT(AR28),INDIRECT(AS28),\"\"),\"\")","v":{"$error":"#N/A"}},{"$f":"IF(COLUMN()>=INDIRECT(AQ28),IF(COLUMN()<=INDIRECT(AR28),INDIRECT(AS28),\"\"),\"\")","v":{"$error":"#N/A"}},{"$f":"IF(COLUMN()>=INDIRECT(AQ28),IF(COLUMN()<=INDIRECT(AR28),INDIRECT(AS28),\"\"),\"\")","v":{"$error":"#N/A"}},{"$f":"IF(COLUMN()>=INDIRECT(AQ28),IF(COLUMN()<=INDIRECT(AR28),INDIRECT(AS28),\"\"),\"\")","v":{"$error":"#N/A"}},{"$f":"IF(COLUMN()>=INDIRECT(AQ28),IF(COLUMN()<=INDIRECT(AR28),INDIRECT(AS28),\"\"),\"\")","v":{"$error":"#N/A"}},{"$f":"IF(COLUMN()>=INDIRECT(AQ28),IF(COLUMN()<=INDIRECT(AR28),INDIRECT(AS28),\"\"),\"\")","v":{"$error":"#N/A"}},{"$f":"IF(COLUMN()>=INDIRECT(AQ28),IF(COLUMN()<=INDIRECT(AR28),INDIRECT(AS28),\"\"),\"\")","v":{"$error":"#N/A"}},{"$f":"IF(COLUMN()>=INDIRECT(AQ28),IF(COLUMN()<=INDIRECT(AR28),INDIRECT(AS28),\"\"),\"\")","v":{"$error":"#N/A"}},{"$f":"IF(COLUMN()>=INDIRECT(AQ28),IF(COLUMN()<=INDIRECT(AR28),INDIRECT(AS28),\"\"),\"\")","v":{"$error":"#N/A"}},{"$f":"IF(COLUMN()>=INDIRECT(AQ28),IF(COLUMN()<=INDIRECT(AR28),INDIRECT(AS28),\"\"),\"\")","v":{"$error":"#N/A"}},{"$f":"IF(COLUMN()>=INDIRECT(AQ28),IF(COLUMN()<=INDIRECT(AR28),INDIRECT(AS28),\"\"),\"\")","v":{"$error":"#N/A"}},{"$f":"IF(COLUMN()>=INDIRECT(AQ28),IF(COLUMN()<=INDIRECT(AR28),INDIRECT(AS28),\"\"),\"\")","v":{"$error":"#N/A"}},{"$f":"IF(COLUMN()>=INDIRECT(AQ28),IF(COLUMN()<=INDIRECT(AR28),INDIRECT(AS28),\"\"),\"\")","v":{"$error":"#N/A"}},{"$f":"IF(COLUMN()>=INDIRECT(AQ28),IF(COLUMN()<=INDIRECT(AR28),INDIRECT(AS28),\"\"),\"\")","v":{"$error":"#N/A"}},{"$f":"IF(COLUMN()>=INDIRECT(AQ28),IF(COLUMN()<=INDIRECT(AR28),INDIRECT(AS28),\"\"),\"\")","v":{"$error":"#N/A"}},{"$f":"IF(COLUMN()>=INDIRECT(AQ28),IF(COLUMN()<=INDIRECT(AR28),INDIRECT(AS28),\"\"),\"\")","v":{"$error":"#N/A"}},{"$f":"IF(COLUMN()>=INDIRECT(AQ28),IF(COLUMN()<=INDIRECT(AR28),INDIRECT(AS28),\"\"),\"\")","v":{"$error":"#N/A"}},{"$f":"IF(COLUMN()>=INDIRECT(AQ28),IF(COLUMN()<=INDIRECT(AR28),INDIRECT(AS28),\"\"),\"\")","v":{"$error":"#N/A"}},{"$f":"IF(COLUMN()>=INDIRECT(AQ28),IF(COLUMN()<=INDIRECT(AR28),INDIRECT(AS28),\"\"),\"\")","v":{"$error":"#N/A"}},{"$f":"IF(COLUMN()>=INDIRECT(AQ28),IF(COLUMN()<=INDIRECT(AR28),INDIRECT(AS28),\"\"),\"\")","v":{"$error":"#N/A"}},{"$f":"IF(COLUMN()>=INDIRECT(AQ28),IF(COLUMN()<=INDIRECT(AR28),INDIRECT(AS28),\"\"),\"\")","v":{"$error":"#N/A"}},{"$f":"IF(COLUMN()>=INDIRECT(AQ28),IF(COLUMN()<=INDIRECT(AR28),INDIRECT(AS28),\"\"),\"\")","v":{"$error":"#N/A"}},{"$f":"IF(COLUMN()>=INDIRECT(AQ28),IF(COLUMN()<=INDIRECT(AR28),INDIRECT(AS28),\"\"),\"\")","v":{"$error":"#N/A"}},{"$f":"IF(COLUMN()>=INDIRECT(AQ28),IF(COLUMN()<=INDIRECT(AR28),INDIRECT(AS28),\"\"),\"\")","v":{"$error":"#N/A"}},{"$f":"IF(COLUMN()>=INDIRECT(AQ28),IF(COLUMN()<=INDIRECT(AR28),INDIRECT(AS28),\"\"),\"\")","v":{"$error":"#N/A"}},{"$f":"IF(COLUMN()>=INDIRECT(AQ28),IF(COLUMN()<=INDIRECT(AR28),INDIRECT(AS28),\"\"),\"\")","v":{"$error":"#N/A"}},{"$f":"IF(COLUMN()>=INDIRECT(AQ28),IF(COLUMN()<=INDIRECT(AR28),INDIRECT(AS28),\"\"),\"\")","v":{"$error":"#N/A"}},{"$f":"IF(COLUMN()>=INDIRECT(AQ28),IF(COLUMN()<=INDIRECT(AR28),INDIRECT(AS28),\"\"),\"\")","v":{"$error":"#N/A"}},{"$f":"IF(COLUMN()>=INDIRECT(AQ28),IF(COLUMN()<=INDIRECT(AR28),INDIRECT(AS28),\"\"),\"\")","v":{"$error":"#N/A"}},{"$f":"IF(COLUMN()>=INDIRECT(AQ28),IF(COLUMN()<=INDIRECT(AR28),INDIRECT(AS28),\"\"),\"\")","v":{"$error":"#N/A"}},{"$f":"IF(COLUMN()>=INDIRECT(AQ28),IF(COLUMN()<=INDIRECT(AR28),INDIRECT(AS28),\"\"),\"\")","v":{"$error":"#N/A"}},{"$f":"IF(COLUMN()>=INDIRECT(AQ28),IF(COLUMN()<=INDIRECT(AR28),INDIRECT(AS28),\"\"),\"\")","v":{"$error":"#N/A"}},{"$f":"IF(COLUMN()>=INDIRECT(AQ28),IF(COLUMN()<=INDIRECT(AR28),INDIRECT(AS28),\"\"),\"\")","v":{"$error":"#N/A"}},{"$f":"IF(COLUMN()>=INDIRECT(AQ28),IF(COLUMN()<=INDIRECT(AR28),INDIRECT(AS28),\"\"),\"\")","v":{"$error":"#N/A"}},{"$f":"IF(COLUMN()>=INDIRECT(AQ28),IF(COLUMN()<=INDIRECT(AR28),INDIRECT(AS28),\"\"),\"\")","v":{"$error":"#N/A"}},null,{"$f":"CONCATENATE(\"'\",SUBSTITUTE(SUBSTITUTE(SUBSTITUTE(MID(CELL(\"direccion\",'ETAPA III.a'!M$1),FIND(\"]\",CELL(\"direccion\",'ETAPA III.a'!M$1))+1,LEN(CELL(\"direccion\",'ETAPA III.a'!M$1))),\"$\",\"\"),1,MATCH($A25,'ETAPA III.a'!$K:$K,0)),\"!\",\"!$\"))","v":"'ETAPA III.a'!$M110"},{"$f":"CONCATENATE(\"'\",SUBSTITUTE(SUBSTITUTE(SUBSTITUTE(MID(CELL(\"direccion\",'ETAPA III.a'!N$1),FIND(\"]\",CELL(\"direccion\",'ETAPA III.a'!N$1))+1,LEN(CELL(\"direccion\",'ETAPA III.a'!N$1))),\"$\",\"\"),1,MATCH($A25,'ETAPA III.a'!$K:$K,0)),\"!\",\"!$\"))","v":"'ETAPA III.a'!$N110"},{"$f":"CONCATENATE(\"'\",SUBSTITUTE(SUBSTITUTE(SUBSTITUTE(MID(CELL(\"direccion\",'ETAPA III.a'!L$1),FIND(\"]\",CELL(\"direccion\",'ETAPA III.a'!L$1))+1,LEN(CELL(\"direccion\",'ETAPA III.a'!L$1))),\"$\",\"\"),1,MATCH($A25,'ETAPA III.a'!$K:$K,0)),\"!\",\"!$\"))","v":"'ETAPA III.a'!$L110"}]
[16,{"$f":"IF(COLUMN()>=INDIRECT(AQ29),IF(COLUMN()<=INDIRECT(AR29),INDIRECT(AS29),\"\"),\"\")","v":{"$error":"#N/A"}},{"$f":"IF(COLUMN()>=INDIRECT(AQ29),IF(COLUMN()<=INDIRECT(AR29),INDIRECT(AS29),\"\"),\"\")","v":{"$error":"#N/A"}},{"$f":"IF(COLUMN()>=INDIRECT(AQ29),IF(COLUMN()<=INDIRECT(AR29),INDIRECT(AS29),\"\"),\"\")","v":{"$error":"#N/A"}},{"$f":"IF(COLUMN()>=INDIRECT(AQ29),IF(COLUMN()<=INDIRECT(AR29),INDIRECT(AS29),\"\"),\"\")","v":{"$error":"#N/A"}},{"$f":"IF(COLUMN()>=INDIRECT(AQ29),IF(COLUMN()<=INDIRECT(AR29),INDIRECT(AS29),\"\"),\"\")","v":{"$error":"#N/A"}},{"$f":"IF(COLUMN()>=INDIRECT(AQ29),IF(COLUMN()<=INDIRECT(AR29),INDIRECT(AS29),\"\"),\"\")","v":{"$error":"#N/A"}},{"$f":"IF(COLUMN()>=INDIRECT(AQ29),IF(COLUMN()<=INDIRECT(AR29),INDIRECT(AS29),\"\"),\"\")","v":{"$error":"#N/A"}},{"$f":"IF(COLUMN()>=INDIRECT(AQ29),IF(COLUMN()<=INDIRECT(AR29),INDIRECT(AS29),\"\"),\"\")","v":{"$error":"#N/A"}},{"$f":"IF(COLUMN()>=INDIRECT(AQ29),IF(COLUMN()<=INDIRECT(AR29),INDIRECT(AS29),\"\"),\"\")","v":{"$error":"#N/A"}},{"$f":"IF(COLUMN()>=INDIRECT(AQ29),IF(COLUMN()<=INDIRECT(AR29),INDIRECT(AS29),\"\"),\"\")","v":{"$error":"#N/A"}},{"$f":"IF(COLUMN()>=INDIRECT(AQ29),IF(COLUMN()<=INDIRECT(AR29),INDIRECT(AS29),\"\"),\"\")","v":{"$error":"#N/A"}},{"$f":"IF(COLUMN()>=INDIRECT(AQ29),IF(COLUMN()<=INDIRECT(AR29),INDIRECT(AS29),\"\"),\"\")","v":{"$error":"#N/A"}},{"$f":"IF(COLUMN()>=INDIRECT(AQ29),IF(COLUMN()<=INDIRECT(AR29),INDIRECT(AS29),\"\"),\"\")","v":{"$error":"#N/A"}},{"$f":"IF(COLUMN()>=INDIRECT(AQ29),IF(COLUMN()<=INDIRECT(AR29),INDIRECT(AS29),\"\"),\"\")","v":{"$error":"#N/A"}},{"$f":"IF(COLUMN()>=INDIRECT(AQ29),IF(COLUMN()<=INDIRECT(AR29),INDIRECT(AS29),\"\"),\"\")","v":{"$error":"#N/A"}},{"$f":"IF(COLUMN()>=INDIRECT(AQ29),IF(COLUMN()<=INDIRECT(AR29),INDIRECT(AS29),\"\"),\"\")","v":{"$error":"#N/A"}},{"$f":"IF(COLUMN()>=INDIRECT(AQ29),IF(COLUMN()<=INDIRECT(AR29),INDIRECT(AS29),\"\"),\"\")","v":{"$error":"#N/A"}},{"$f":"IF(COLUMN()>=INDIRECT(AQ29),IF(COLUMN()<=INDIRECT(AR29),INDIRECT(AS29),\"\"),\"\")","v":{"$error":"#N/A"}},{"$f":"IF(COLUMN()>=INDIRECT(AQ29),IF(COLUMN()<=INDIRECT(AR29),INDIRECT(AS29),\"\"),\"\")","v":{"$error":"#N/A"}},{"$f":"IF(COLUMN()>=INDIRECT(AQ29),IF(COLUMN()<=INDIRECT(AR29),INDIRECT(AS29),\"\"),\"\")","v":{"$error":"#N/A"}},{"$f":"IF(COLUMN()>=INDIRECT(AQ29),IF(COLUMN()<=INDIRECT(AR29),INDIRECT(AS29),\"\"),\"\")","v":{"$error":"#N/A"}},{"$f":"IF(COLUMN()>=INDIRECT(AQ29),IF(COLUMN()<=INDIRECT(AR29),INDIRECT(AS29),\"\"),\"\")","v":{"$error":"#N/A"}},{"$f":"IF(COLUMN()>=INDIRECT(AQ29),IF(COLUMN()<=INDIRECT(AR29),INDIRECT(AS29),\"\"),\"\")","v":{"$error":"#N/A"}},{"$f":"IF(COLUMN()>=INDIRECT(AQ29),IF(COLUMN()<=INDIRECT(AR29),INDIRECT(AS29),\"\"),\"\")","v":{"$error":"#N/A"}},{"$f":"IF(COLUMN()>=INDIRECT(AQ29),IF(COLUMN()<=INDIRECT(AR29),INDIRECT(AS29),\"\"),\"\")","v":{"$error":"#N/A"}},{"$f":"IF(COLUMN()>=INDIRECT(AQ29),IF(COLUMN()<=INDIRECT(AR29),INDIRECT(AS29),\"\"),\"\")","v":{"$error":"#N/A"}},{"$f":"IF(COLUMN()>=INDIRECT(AQ29),IF(COLUMN()<=INDIRECT(AR29),INDIRECT(AS29),\"\"),\"\")","v":{"$error":"#N/A"}},{"$f":"IF(COLUMN()>=INDIRECT(AQ29),IF(COLUMN()<=INDIRECT(AR29),INDIRECT(AS29),\"\"),\"\")","v":{"$error":"#N/A"}},{"$f":"IF(COLUMN()>=INDIRECT(AQ29),IF(COLUMN()<=INDIRECT(AR29),INDIRECT(AS29),\"\"),\"\")","v":{"$error":"#N/A"}},{"$f":"IF(COLUMN()>=INDIRECT(AQ29),IF(COLUMN()<=INDIRECT(AR29),INDIRECT(AS29),\"\"),\"\")","v":{"$error":"#N/A"}},{"$f":"IF(COLUMN()>=INDIRECT(AQ29),IF(COLUMN()<=INDIRECT(AR29),INDIRECT(AS29),\"\"),\"\")","v":{"$error":"#N/A"}},{"$f":"IF(COLUMN()>=INDIRECT(AQ29),IF(COLUMN()<=INDIRECT(AR29),INDIRECT(AS29),\"\"),\"\")","v":{"$error":"#N/A"}},{"$f":"IF(COLUMN()>=INDIRECT(AQ29),IF(COLUMN()<=INDIRECT(AR29),INDIRECT(AS29),\"\"),\"\")","v":{"$error":"#N/A"}},{"$f":"IF(COLUMN()>=INDIRECT(AQ29),IF(COLUMN()<=INDIRECT(AR29),INDIRECT(AS29),\"\"),\"\")","v":{"$error":"#N/A"}},{"$f":"IF(COLUMN()>=INDIRECT(AQ29),IF(COLUMN()<=INDIRECT(AR29),INDIRECT(AS29),\"\"),\"\")","v":{"$error":"#N/A"}},{"$f":"IF(COLUMN()>=INDIRECT(AQ29),IF(COLUMN()<=INDIRECT(AR29),INDIRECT(AS29),\"\"),\"\")","v":{"$error":"#N/A"}},{"$f":"IF(COLUMN()>=INDIRECT(AQ29),IF(COLUMN()<=INDIRECT(AR29),INDIRECT(AS29),\"\"),\"\")","v":{"$error":"#N/A"}},{"$f":"IF(COLUMN()>=INDIRECT(AQ29),IF(COLUMN()<=INDIRECT(AR29),INDIRECT(AS29),\"\"),\"\")","v":{"$error":"#N/A"}},{"$f":"IF(COLUMN()>=INDIRECT(AQ29),IF(COLUMN()<=INDIRECT(AR29),INDIRECT(AS29),\"\"),\"\")","v":{"$error":"#N/A"}},{"$f":"IF(COLUMN()>=INDIRECT(AQ29),IF(COLUMN()<=INDIRECT(AR29),INDIRECT(AS29),\"\"),\"\")","v":{"$error":"#N/A"}},null,{"$f":"CONCATENATE(\"'\",SUBSTITUTE(SUBSTITUTE(SUBSTITUTE(MID(CELL(\"direccion\",'ETAPA III.a'!M$1),FIND(\"]\",CELL(\"direccion\",'ETAPA III.a'!M$1))+1,LEN(CELL(\"direccion\",'ETAPA III.a'!M$1))),\"$\",\"\"),1,MATCH($A26,'ETAPA III.a'!$K:$K,0)),\"!\",\"!$\"))","v":"'ETAPA III.a'!$M117"},{"$f":"CONCATENATE(\"'\",SUBSTITUTE(SUBSTITUTE(SUBSTITUTE(MID(CELL(\"direccion\",'ETAPA III.a'!N$1),FIND(\"]\",CELL(\"direccion\",'ETAPA III.a'!N$1))+1,LEN(CELL(\"direccion\",'ETAPA III.a'!N$1))),\"$\",\"\"),1,MATCH($A26,'ETAPA III.a'!$K:$K,0)),\"!\",\"!$\"))","v":"'ETAPA III.a'!$N117"},{"$f":"CONCATENATE(\"'\",SUBSTITUTE(SUBSTITUTE(SUBSTITUTE(MID(CELL(\"direccion\",'ETAPA III.a'!L$1),FIND(\"]\",CELL(\"direccion\",'ETAPA III.a'!L$1))+1,LEN(CELL(\"direccion\",'ETAPA III.a'!L$1))),\"$\",\"\"),1,MATCH($A26,'ETAPA III.a'!$K:$K,0)),\"!\",\"!$\"))","v":"'ETAPA III.a'!$L117"}]
[17,{"$f":"IF(COLUMN()>=INDIRECT(AQ30),IF(COLUMN()<=INDIRECT(AR30),INDIRECT(AS30),\"\"),\"\")","v":{"$error":"#N/A"}},{"$f":"IF(COLUMN()>=INDIRECT(AQ30),IF(COLUMN()<=INDIRECT(AR30),INDIRECT(AS30),\"\"),\"\")","v":{"$error":"#N/A"}},{"$f":"IF(COLUMN()>=INDIRECT(AQ30),IF(COLUMN()<=INDIRECT(AR30),INDIRECT(AS30),\"\"),\"\")","v":{"$error":"#N/A"}},{"$f":"IF(COLUMN()>=INDIRECT(AQ30),IF(COLUMN()<=INDIRECT(AR30),INDIRECT(AS30),\"\"),\"\")","v":{"$error":"#N/A"}},{"$f":"IF(COLUMN()>=INDIRECT(AQ30),IF(COLUMN()<=INDIRECT(AR30),INDIRECT(AS30),\"\"),\"\")","v":{"$error":"#N/A"}},{"$f":"IF(COLUMN()>=INDIRECT(AQ30),IF(COLUMN()<=INDIRECT(AR30),INDIRECT(AS30),\"\"),\"\")","v":{"$error":"#N/A"}},{"$f":"IF(COLUMN()>=INDIRECT(AQ30),IF(COLUMN()<=INDIRECT(AR30),INDIRECT(AS30),\"\"),\"\")","v":{"$error":"#N/A"}},{"$f":"IF(COLUMN()>=INDIRECT(AQ30),IF(COLUMN()<=INDIRECT(AR30),INDIRECT(AS30),\"\"),\"\")","v":{"$error":"#N/A"}},{"$f":"IF(COLUMN()>=INDIRECT(AQ30),IF(COLUMN()<=INDIRECT(AR30),INDIRECT(AS30),\"\"),\"\")","v":{"$error":"#N/A"}},{"$f":"IF(COLUMN()>=INDIRECT(AQ30),IF(COLUMN()<=INDIRECT(AR30),INDIRECT(AS30),\"\"),\"\")","v":{"$error":"#N/A"}},{"$f":"IF(COLUMN()>=INDIRECT(AQ30),IF(COLUMN()<=INDIRECT(AR30),INDIRECT(AS30),\"\"),\"\")","v":{"$error":"#N/A"}},{"$f":"IF(COLUMN()>=INDIRECT(AQ30),IF(COLUMN()<=INDIRECT(AR30),INDIRECT(AS30),\"\"),\"\")","v":{"$error":"#N/A"}},{"$f":"IF(COLUMN()>=INDIRECT(AQ30),IF(COLUMN()<=INDIRECT(AR30),INDIRECT(AS30),\"\"),\"\")","v":{"$error":"#N/A"}},{"$f":"IF(COLUMN()>=INDIRECT(AQ30),IF(COLUMN()<=INDIRECT(AR30),INDIRECT(AS30),\"\"),\"\")","v":{"$error":"#N/A"}},{"$f":"IF(COLUMN()>=INDIRECT(AQ30),IF(COLUMN()<=INDIRECT(AR30),INDIRECT(AS30),\"\"),\"\")","v":{"$error":"#N/A"}},{"$f":"IF(COLUMN()>=INDIRECT(AQ30),IF(COLUMN()<=INDIRECT(AR30),INDIRECT(AS30),\"\"),\"\")","v":{"$error":"#N/A"}},{"$f":"IF(COLUMN()>=INDIRECT(AQ30),IF(COLUMN()<=INDIRECT(AR30),INDIRECT(AS30),\"\"),\"\")","v":{"$error":"#N/A"}},{"$f":"IF(COLUMN()>=INDIRECT(AQ30),IF(COLUMN()<=INDIRECT(AR30),INDIRECT(AS30),\"\"),\"\")","v":{"$error":"#N/A"}},{"$f":"IF(COLUMN()>=INDIRECT(AQ30),IF(COLUMN()<=INDIRECT(AR30),INDIRECT(AS30),\"\"),\"\")","v":{"$error":"#N/A"}},{"$f":"IF(COLUMN()>=INDIRECT(AQ30),IF(COLUMN()<=INDIRECT(AR30),INDIRECT(AS30),\"\"),\"\")","v":{"$error":"#N/A"}},{"$f":"IF(COLUMN()>=INDIRECT(AQ30),IF(COLUMN()<=INDIRECT(AR30),INDIRECT(AS30),\"\"),\"\")","v":{"$error":"#N/A"}},{"$f":"IF(COLUMN()>=INDIRECT(AQ30),IF(COLUMN()<=INDIRECT(AR30),INDIRECT(AS30),\"\"),\"\")","v":{"$error":"#N/A"}},{"$f":"IF(COLUMN()>=INDIRECT(AQ30),IF(COLUMN()<=INDIRECT(AR30),INDIRECT(AS30),\"\"),\"\")","v":{"$error":"#N/A"}},{"$f":"IF(COLUMN()>=INDIRECT(AQ30),IF(COLUMN()<=INDIRECT(AR30),INDIRECT(AS30),\"\"),\"\")","v":{"$error":"#N/A"}},{"$f":"IF(COLUMN()>=INDIRECT(AQ30),IF(COLUMN()<=INDIRECT(AR30),INDIRECT(AS30),\"\"),\"\")","v":{"$error":"#N/A"}},{"$f":"IF(COLUMN()>=INDIRECT(AQ30),IF(COLUMN()<=INDIRECT(AR30),INDIRECT(AS30),\"\"),\"\")","v":{"$error":"#N/A"}},{"$f":"IF(COLUMN()>=INDIRECT(AQ30),IF(COLUMN()<=INDIRECT(AR30),INDIRECT(AS30),\"\"),\"\")","v":{"$error":"#N/A"}},{"$f":"IF(COLUMN()>=INDIRECT(AQ30),IF(COLUMN()<=INDIRECT(AR30),INDIRECT(AS30),\"\"),\"\")","v":{"$error":"#N/A"}},{"$f":"IF(COLUMN()>=INDIRECT(AQ30),IF(COLUMN()<=INDIRECT(AR30),INDIRECT(AS30),\"\"),\"\")","v":{"$error":"#N/A"}},{"$f":"IF(COLUMN()>=INDIRECT(AQ30),IF(COLUMN()<=INDIRECT(AR30),INDIRECT(AS30),\"\"),\"\")","v":{"$error":"#N/A"}},{"$f":"IF(COLUMN()>=INDIRECT(AQ30),IF(COLUMN()<=INDIRECT(AR30),INDIRECT(AS30),\"\"),\"\")","v":{"$error":"#N/A"}},{"$f":"IF(COLUMN()>=INDIRECT(AQ30),IF(COLUMN()<=INDIRECT(AR30),INDIRECT(AS30),\"\"),\"\")","v":{"$error":"#N/A"}},{"$f":"IF(COLUMN()>=INDIRECT(AQ30),IF(COLUMN()<=INDIRECT(AR30),INDIRECT(AS30),\"\"),\"\")","v":{"$error":"#N/A"}},{"$f":"IF(COLUMN()>=INDIRECT(AQ30),IF(COLUMN()<=INDIRECT(AR30),INDIRECT(AS30),\"\"),\"\")","v":{"$error":"#N/A"}},{"$f":"IF(COLUMN()>=INDIRECT(AQ30),IF(COLUMN()<=INDIRECT(AR30),INDIRECT(AS30),\"\"),\"\")","v":{"$error":"#N/A"}},{"$f":"IF(COLUMN()>=INDIRECT(AQ30),IF(COLUMN()<=INDIRECT(AR30),INDIRECT(AS30),\"\"),\"\")","v":{"$error":"#N/A"}},{"$f":"IF(COLUMN()>=INDIRECT(AQ30),IF(COLUMN()<=INDIRECT(AR30),INDIRECT(AS30),\"\"),\"\")","v":{"$error":"#N/A"}},{"$f":"IF(COLUMN()>=INDIRECT(AQ30),IF(COLUMN()<=INDIRECT(AR30),INDIRECT(AS30),\"\"),\"\")","v":{"$error":"#N/A"}},{"$f":"IF(COLUMN()>=INDIRECT(AQ30),IF(COLUMN()<=INDIRECT(AR30),INDIRECT(AS30),\"\"),\"\")","v":{"$error":"#N/A"}},{"$f":"IF(COLUMN()>=INDIRECT(AQ30),IF(COLUMN()<=INDIRECT(AR30),INDIRECT(AS30),\"\"),\"\")","v":{"$error":"#N/A"}},null,{"$f":"CONCATENATE(\"'\",SUBSTITUTE(SUBSTITUTE(SUBSTITUTE(MID(CELL(\"direccion\",'ETAPA III.a'!M$1),FIND(\"]\",CELL(\"direccion\",'ETAPA III.a'!M$1))+1,LEN(CELL(\"direccion\",'ETAPA III.a'!M$1))),\"$\",\"\"),1,MATCH($A27,'ETAPA III.a'!$K:$K,0)),\"!\",\"!$\"))","v":"'ETAPA III.a'!$M124"},{"$f":"CONCATENATE(\"'\",SUBSTITUTE(SUBSTITUTE(SUBSTITUTE(MID(CELL(\"direccion\",'ETAPA III.a'!N$1),FIND(\"]\",CELL(\"direccion\",'ETAPA III.a'!N$1))+1,LEN(CELL(\"direccion\",'ETAPA III.a'!N$1))),\"$\",\"\"),1,MATCH($A27,'ETAPA III.a'!$K:$K,0)),\"!\",\"!$\"))","v":"'ETAPA III.a'!$N124"},{"$f":"CONCATENATE(\"'\",SUBSTITUTE(SUBSTITUTE(SUBSTITUTE(MID(CELL(\"direccion\",'ETAPA III.a'!L$1),FIND(\"]\",CELL(\"direccion\",'ETAPA III.a'!L$1))+1,LEN(CELL(\"direccion\",'ETAPA III.a'!L$1))),\"$\",\"\"),1,MATCH($A27,'ETAPA III.a'!$K:$K,0)),\"!\",\"!$\"))","v":"'ETAPA III.a'!$L124"}]
[18,{"$f":"IF(COLUMN()>=INDIRECT(AQ31),IF(COLUMN()<=INDIRECT(AR31),INDIRECT(AS31),\"\"),\"\")","v":{"$error":"#N/A"}},{"$f":"IF(COLUMN()>=INDIRECT(AQ31),IF(COLUMN()<=INDIRECT(AR31),INDIRECT(AS31),\"\"),\"\")","v":{"$error":"#N/A"}},{"$f":"IF(COLUMN()>=INDIRECT(AQ31),IF(COLUMN()<=INDIRECT(AR31),INDIRECT(AS31),\"\"),\"\")","v":{"$error":"#N/A"}},{"$f":"IF(COLUMN()>=INDIRECT(AQ31),IF(COLUMN()<=INDIRECT(AR31),INDIRECT(AS31),\"\"),\"\")","v":{"$error":"#N/A"}},{"$f":"IF(COLUMN()>=INDIRECT(AQ31),IF(COLUMN()<=INDIRECT(AR31),INDIRECT(AS31),\"\"),\"\")","v":{"$error":"#N/A"}},{"$f":"IF(COLUMN()>=INDIRECT(AQ31),IF(COLUMN()<=INDIRECT(AR31),INDIRECT(AS31),\"\"),\"\")","v":{"$error":"#N/A"}},{"$f":"IF(COLUMN()>=INDIRECT(AQ31),IF(COLUMN()<=INDIRECT(AR31),INDIRECT(AS31),\"\"),\"\")","v":{"$error":"#N/A"}},{"$f":"IF(COLUMN()>=INDIRECT(AQ31),IF(COLUMN()<=INDIRECT(AR31),INDIRECT(AS31),\"\"),\"\")","v":{"$error":"#N/A"}},{"$f":"IF(COLUMN()>=INDIRECT(AQ31),IF(COLUMN()<=INDIRECT(AR31),INDIRECT(AS31),\"\"),\"\")","v":{"$error":"#N/A"}},{"$f":"IF(COLUMN()>=INDIRECT(AQ31),IF(COLUMN()<=INDIRECT(AR31),INDIRECT(AS31),\"\"),\"\")","v":{"$error":"#N/A"}},{"$f":"IF(COLUMN()>=INDIRECT(AQ31),IF(COLUMN()<=INDIRECT(AR31),INDIRECT(AS31),\"\"),\"\")","v":{"$error":"#N/A"}},{"$f":"IF(COLUMN()>=INDIRECT(AQ31),IF(COLUMN()<=INDIRECT(AR31),INDIRECT(AS31),\"\"),\"\")","v":{"$error":"#N/A"}},{"$f":"IF(COLUMN()>=INDIRECT(AQ31),IF(COLUMN()<=INDIRECT(AR31),INDIRECT(AS31),\"\"),\"\")","v":{"$error":"#N/A"}},{"$f":"IF(COLUMN()>=INDIRECT(AQ31),IF(COLUMN()<=INDIRECT(AR31),INDIRECT(AS31),\"\"),\"\")","v":{"$error":"#N/A"}},{"$f":"IF(COLUMN()>=INDIRECT(AQ31),IF(COLUMN()<=INDIRECT(AR31),INDIRECT(AS31),\"\"),\"\")","v":{"$error":"#N/A"}},{"$f":"IF(COLUMN()>=INDIRECT(AQ31),IF(COLUMN()<=INDIRECT(AR31),INDIRECT(AS31),\"\"),\"\")","v":{"$error":"#N/A"}},{"$f":"IF(COLUMN()>=INDIRECT(AQ31),IF(COLUMN()<=INDIRECT(AR31),INDIRECT(AS31),\"\"),\"\")","v":{"$error":"#N/A"}},{"$f":"IF(COLUMN()>=INDIRECT(AQ31),IF(COLUMN()<=INDIRECT(AR31),INDIRECT(AS31),\"\"),\"\")","v":{"$error":"#N/A"}},{"$f":"IF(COLUMN()>=INDIRECT(AQ31),IF(COLUMN()<=INDIRECT(AR31),INDIRECT(AS31),\"\"),\"\")","v":{"$error":"#N/A"}},{"$f":"IF(COLUMN()>=INDIRECT(AQ31),IF(COLUMN()<=INDIRECT(AR31),INDIRECT(AS31),\"\"),\"\")","v":{"$error":"#N/A"}},{"$f":"IF(COLUMN()>=INDIRECT(AQ31),IF(COLUMN()<=INDIRECT(AR31),INDIRECT(AS31),\"\"),\"\")","v":{"$error":"#N/A"}},{"$f":"IF(COLUMN()>=INDIRECT(AQ31),IF(COLUMN()<=INDIRECT(AR31),INDIRECT(AS31),\"\"),\"\")","v":{"$error":"#N/A"}},{"$f":"IF(COLUMN()>=INDIRECT(AQ31),IF(COLUMN()<=INDIRECT(AR31),INDIRECT(AS31),\"\"),\"\")","v":{"$error":"#N/A"}},{"$f":"IF(COLUMN()>=INDIRECT(AQ31),IF(COLUMN()<=INDIRECT(AR31),INDIRECT(AS31),\"\"),\"\")","v":{"$error":"#N/A"}},{"$f":"IF(COLUMN()>=INDIRECT(AQ31),IF(COLUMN()<=INDIRECT(AR31),INDIRECT(AS31),\"\"),\"\")","v":{"$error":"#N/A"}},{"$f":"IF(COLUMN()>=INDIRECT(AQ31),IF(COLUMN()<=INDIRECT(AR31),INDIRECT(AS31),\"\"),\"\")","v":{"$error":"#N/A"}},{"$f":"IF(COLUMN()>=INDIRECT(AQ31),IF(COLUMN()<=INDIRECT(AR31),INDIRECT(AS31),\"\"),\"\")","v":{"$error":"#N/A"}},{"$f":"IF(COLUMN()>=INDIRECT(AQ31),IF(COLUMN()<=INDIRECT(AR31),INDIRECT(AS31),\"\"),\"\")","v":{"$error":"#N/A"}},{"$f":"IF(COLUMN()>=INDIRECT(AQ31),IF(COLUMN()<=INDIRECT(AR31),INDIRECT(AS31),\"\"),\"\")","v":{"$error":"#N/A"}},{"$f":"IF(COLUMN()>=INDIRECT(AQ31),IF(COLUMN()<=INDIRECT(AR31),INDIRECT(AS31),\"\"),\"\")","v":{"$error":"#N/A"}},{"$f":"IF(COLUMN()>=INDIRECT(AQ31),IF(COLUMN()<=INDIRECT(AR31),INDIRECT(AS31),\"\"),\"\")","v":{"$error":"#N/A"}},{"$f":"IF(COLUMN()>=INDIRECT(AQ31),IF(COLUMN()<=INDIRECT(AR31),INDIRECT(AS31),\"\"),\"\")","v":{"$error":"#N/A"}},{"$f":"IF(COLUMN()>=INDIRECT(AQ31),IF(COLUMN()<=INDIRECT(AR31),INDIRECT(AS31),\"\"),\"\")","v":{"$error":"#N/A"}},{"$f":"IF(COLUMN()>=INDIRECT(AQ31),IF(COLUMN()<=INDIRECT(AR31),INDIRECT(AS31),\"\"),\"\")","v":{"$error":"#N/A"}},{"$f":"IF(COLUMN()>=INDIRECT(AQ31),IF(COLUMN()<=INDIRECT(AR31),INDIRECT(AS31),\"\"),\"\")","v":{"$error":"#N/A"}},{"$f":"IF(COLUMN()>=INDIRECT(AQ31),IF(COLUMN()<=INDIRECT(AR31),INDIRECT(AS31),\"\"),\"\")","v":{"$error":"#N/A"}},{"$f":"IF(COLUMN()>=INDIRECT(AQ31),IF(COLUMN()<=INDIRECT(AR31),INDIRECT(AS31),\"\"),\"\")","v":{"$error":"#N/A"}},{"$f":"IF(COLUMN()>=INDIRECT(AQ31),IF(COLUMN()<=INDIRECT(AR31),INDIRECT(AS31),\"\"),\"\")","v":{"$error":"#N/A"}},{"$f":"IF(COLUMN()>=INDIRECT(AQ31),IF(COLUMN()<=INDIRECT(AR31),INDIRECT(AS31),\"\"),\"\")","v":{"$error":"#N/A"}},{"$f":"IF(COLUMN()>=INDIRECT(AQ31),IF(COLUMN()<=INDIRECT(AR31),INDIRECT(AS31),\"\"),\"\")","v":{"$error":"#N/A"}},null,{"$f":"CONCATENATE(\"'\",SUBSTITUTE(SUBSTITUTE(SUBSTITUTE(MID(CELL(\"direccion\",'ETAPA III.a'!M$1),FIND(\"]\",CELL(\"direccion\",'ETAPA III.a'!M$1))+1,LEN(CELL(\"direccion\",'ETAPA III.a'!M$1))),\"$\",\"\"),1,MATCH($A28,'ETAPA III.a'!$K:$K,0)),\"!\",\"!$\"))","v":"'ETAPA III.a'!$M131"},{"$f":"CONCATENATE(\"'\",SUBSTITUTE(SUBSTITUTE(SUBSTITUTE(MID(CELL(\"direccion\",'ETAPA III.a'!N$1),FIND(\"]\",CELL(\"direccion\",'ETAPA III.a'!N$1))+1,LEN(CELL(\"direccion\",'ETAPA III.a'!N$1))),\"$\",\"\"),1,MATCH($A28,'ETAPA III.a'!$K:$K,0)),\"!\",\"!$\"))","v":"'ETAPA III.a'!$N131"},{"$f":"CONCATENATE(\"'\",SUBSTITUTE(SUBSTITUTE(SUBSTITUTE(MID(CELL(\"direccion\",'ETAPA III.a'!L$1),FIND(\"]\",CELL(\"direccion\",'ETAPA III.a'!L$1))+1,LEN(CELL(\"direccion\",'ETAPA III.a'!L$1))),\"$\",\"\"),1,MATCH($A28,'ETAPA III.a'!$K:$K,0)),\"!\",\"!$\"))","v":"'ETAPA III.a'!$L131"}]
[19,{"$f":"IF(COLUMN()>=INDIRECT(AQ32),IF(COLUMN()<=INDIRECT(AR32),INDIRECT(AS32),\"\"),\"\")","v":{"$error":"#N/A"}},{"$f":"IF(COLUMN()>=INDIRECT(AQ32),IF(COLUMN()<=INDIRECT(AR32),INDIRECT(AS32),\"\"),\"\")","v":{"$error":"#N/A"}},{"$f":"IF(COLUMN()>=INDIRECT(AQ32),IF(COLUMN()<=INDIRECT(AR32),INDIRECT(AS32),\"\"),\"\")","v":{"$error":"#N/A"}},{"$f":"IF(COLUMN()>=INDIRECT(AQ32),IF(COLUMN()<=INDIRECT(AR32),INDIRECT(AS32),\"\"),\"\")","v":{"$error":"#N/A"}},{"$f":"IF(COLUMN()>=INDIRECT(AQ32),IF(COLUMN()<=INDIRECT(AR32),INDIRECT(AS32),\"\"),\"\")","v":{"$error":"#N/A"}},{"$f":"IF(COLUMN()>=INDIRECT(AQ32),IF(COLUMN()<=INDIRECT(AR32),INDIRECT(AS32),\"\"),\"\")","v":{"$error":"#N/A"}},{"$f":"IF(COLUMN()>=INDIRECT(AQ32),IF(COLUMN()<=INDIRECT(AR32),INDIRECT(AS32),\"\"),\"\")","v":{"$error":"#N/A"}},{"$f":"IF(COLUMN()>=INDIRECT(AQ32),IF(COLUMN()<=INDIRECT(AR32),INDIRECT(AS32),\"\"),\"\")","v":{"$error":"#N/A"}},{"$f":"IF(COLUMN()>=INDIRECT(AQ32),IF(COLUMN()<=INDIRECT(AR32),INDIRECT(AS32),\"\"),\"\")","v":{"$error":"#N/A"}},{"$f":"IF(COLUMN()>=INDIRECT(AQ32),IF(COLUMN()<=INDIRECT(AR32),INDIRECT(AS32),\"\"),\"\")","v":{"$error":"#N/A"}},{"$f":"IF(COLUMN()>=INDIRECT(AQ32),IF(COLUMN()<=INDIRECT(AR32),INDIRECT(AS32),\"\"),\"\")","v":{"$error":"#N/A"}},{"$f":"IF(COLUMN()>=INDIRECT(AQ32),IF(COLUMN()<=INDIRECT(AR32),INDIRECT(AS32),\"\"),\"\")","v":{"$error":"#N/A"}},{"$f":"IF(COLUMN()>=INDIRECT(AQ32),IF(COLUMN()<=INDIRECT(AR32),INDIRECT(AS32),\"\"),\"\")","v":{"$error":"#N/A"}},{"$f":"IF(COLUMN()>=INDIRECT(AQ32),IF(COLUMN()<=INDIRECT(AR32),INDIRECT(AS32),\"\"),\"\")","v":{"$error":"#N/A"}},{"$f":"IF(COLUMN()>=INDIRECT(AQ32),IF(COLUMN()<=INDIRECT(AR32),INDIRECT(AS32),\"\"),\"\")","v":{"$error":"#N/A"}},{"$f":"IF(COLUMN()>=INDIRECT(AQ32),IF(COLUMN()<=INDIRECT(AR32),INDIRECT(AS32),\"\"),\"\")","v":{"$error":"#N/A"}},{"$f":"IF(COLUMN()>=INDIRECT(AQ32),IF(COLUMN()<=INDIRECT(AR32),INDIRECT(AS32),\"\"),\"\")","v":{"$error":"#N/A"}},{"$f":"IF(COLUMN()>=INDIRECT(AQ32),IF(COLUMN()<=INDIRECT(AR32),INDIRECT(AS32),\"\"),\"\")","v":{"$error":"#N/A"}},{"$f":"IF(COLUMN()>=INDIRECT(AQ32),IF(COLUMN()<=INDIRECT(AR32),INDIRECT(AS32),\"\"),\"\")","v":{"$error":"#N/A"}},{"$f":"IF(COLUMN()>=INDIRECT(AQ32),IF(COLUMN()<=INDIRECT(AR32),INDIRECT(AS32),\"\"),\"\")","v":{"$error":"#N/A"}},{"$f":"IF(COLUMN()>=INDIRECT(AQ32),IF(COLUMN()<=INDIRECT(AR32),INDIRECT(AS32),\"\"),\"\")","v":{"$error":"#N/A"}},{"$f":"IF(COLUMN()>=INDIRECT(AQ32),IF(COLUMN()<=INDIRECT(AR32),INDIRECT(AS32),\"\"),\"\")","v":{"$error":"#N/A"}},{"$f":"IF(COLUMN()>=INDIRECT(AQ32),IF(COLUMN()<=INDIRECT(AR32),INDIRECT(AS32),\"\"),\"\")","v":{"$error":"#N/A"}},{"$f":"IF(COLUMN()>=INDIRECT(AQ32),IF(COLUMN()<=INDIRECT(AR32),INDIRECT(AS32),\"\"),\"\")","v":{"$error":"#N/A"}},{"$f":"IF(COLUMN()>=INDIRECT(AQ32),IF(COLUMN()<=INDIRECT(AR32),INDIRECT(AS32),\"\"),\"\")","v":{"$error":"#N/A"}},{"$f":"IF(COLUMN()>=INDIRECT(AQ32),IF(COLUMN()<=INDIRECT(AR32),INDIRECT(AS32),\"\"),\"\")","v":{"$error":"#N/A"}},{"$f":"IF(COLUMN()>=INDIRECT(AQ32),IF(COLUMN()<=INDIRECT(AR32),INDIRECT(AS32),\"\"),\"\")","v":{"$error":"#N/A"}},{"$f":"IF(COLUMN()>=INDIRECT(AQ32),IF(COLUMN()<=INDIRECT(AR32),INDIRECT(AS32),\"\"),\"\")","v":{"$error":"#N/A"}},{"$f":"IF(COLUMN()>=INDIRECT(AQ32),IF(COLUMN()<=INDIRECT(AR32),INDIRECT(AS32),\"\"),\"\")","v":{"$error":"#N/A"}},{"$f":"IF(COLUMN()>=INDIRECT(AQ32),IF(COLUMN()<=INDIRECT(AR32),INDIRECT(AS32),\"\"),\"\")","v":{"$error":"#N/A"}},{"$f":"IF(COLUMN()>=INDIRECT(AQ32),IF(COLUMN()<=INDIRECT(AR32),INDIRECT(AS32),\"\"),\"\")","v":{"$error":"#N/A"}},{"$f":"IF(COLUMN()>=INDIRECT(AQ32),IF(COLUMN()<=INDIRECT(AR32),INDIRECT(AS32),\"\"),\"\")","v":{"$error":"#N/A"}},{"$f":"IF(COLUMN()>=INDIRECT(AQ32),IF(COLUMN()<=INDIRECT(AR32),INDIRECT(AS32),\"\"),\"\")","v":{"$error":"#N/A"}},{"$f":"IF(COLUMN()>=INDIRECT(AQ32),IF(COLUMN()<=INDIRECT(AR32),INDIRECT(AS32),\"\"),\"\")","v":{"$error":"#N/A"}},{"$f":"IF(COLUMN()>=INDIRECT(AQ32),IF(COLUMN()<=INDIRECT(AR32),INDIRECT(AS32),\"\"),\"\")","v":{"$error":"#N/A"}},{"$f":"IF(COLUMN()>=INDIRECT(AQ32),IF(COLUMN()<=INDIRECT(AR32),INDIRECT(AS32),\"\"),\"\")","v":{"$error":"#N/A"}},{"$f":"IF(COLUMN()>=INDIRECT(AQ32),IF(COLUMN()<=INDIRECT(AR32),INDIRECT(AS32),\"\"),\"\")","v":{"$error":"#N/A"}},{"$f":"IF(COLUMN()>=INDIRECT(AQ32),IF(COLUMN()<=INDIRECT(AR32),INDIRECT(AS32),\"\"),\"\")","v":{"$error":"#N/A"}},{"$f":"IF(COLUMN()>=INDIRECT(AQ32),IF(COLUMN()<=INDIRECT(AR32),INDIRECT(AS32),\"\"),\"\")","v":{"$error":"#N/A"}},{"$f":"IF(COLUMN()>=INDIRECT(AQ32),IF(COLUMN()<=INDIRECT(AR32),INDIRECT(AS32),\"\"),\"\")","v":{"$error":"#N/A"}},null,{"$f":"CONCATENATE(\"'\",SUBSTITUTE(SUBSTITUTE(SUBSTITUTE(MID(CELL(\"direccion\",'ETAPA III.a'!M$1),FIND(\"]\",CELL(\"direccion\",'ETAPA III.a'!M$1))+1,LEN(CELL(\"direccion\",'ETAPA III.a'!M$1))),\"$\",\"\"),1,MATCH($A29,'ETAPA III.a'!$K:$K,0)),\"!\",\"!$\"))","v":"'ETAPA III.a'!$M141"},{"$f":"CONCATENATE(\"'\",SUBSTITUTE(SUBSTITUTE(SUBSTITUTE(MID(CELL(\"direccion\",'ETAPA III.a'!N$1),FIND(\"]\",CELL(\"direccion\",'ETAPA III.a'!N$1))+1,LEN(CELL(\"direccion\",'ETAPA III.a'!N$1))),\"$\",\"\"),1,MATCH($A29,'ETAPA III.a'!$K:$K,0)),\"!\",\"!$\"))","v":"'ETAPA III.a'!$N141"},{"$f":"CONCATENATE(\"'\",SUBSTITUTE(SUBSTITUTE(SUBSTITUTE(MID(CELL(\"direccion\",'ETAPA III.a'!L$1),FIND(\"]\",CELL(\"direccion\",'ETAPA III.a'!L$1))+1,LEN(CELL(\"direccion\",'ETAPA III.a'!L$1))),\"$\",\"\"),1,MATCH($A29,'ETAPA III.a'!$K:$K,0)),\"!\",\"!$\"))","v":"'ETAPA III.a'!$L141"}]
[20,{"$f":"IF(COLUMN()>=INDIRECT(AQ33),IF(COLUMN()<=INDIRECT(AR33),INDIRECT(AS33),\"\"),\"\")","v":{"$error":"#N/A"}},{"$f":"IF(COLUMN()>=INDIRECT(AQ33),IF(COLUMN()<=INDIRECT(AR33),INDIRECT(AS33),\"\"),\"\")","v":{"$error":"#N/A"}},{"$f":"IF(COLUMN()>=INDIRECT(AQ33),IF(COLUMN()<=INDIRECT(AR33),INDIRECT(AS33),\"\"),\"\")","v":{"$error":"#N/A"}},{"$f":"IF(COLUMN()>=INDIRECT(AQ33),IF(COLUMN()<=INDIRECT(AR33),INDIRECT(AS33),\"\"),\"\")","v":{"$error":"#N/A"}},{"$f":"IF(COLUMN()>=INDIRECT(AQ33),IF(COLUMN()<=INDIRECT(AR33),INDIRECT(AS33),\"\"),\"\")","v":{"$error":"#N/A"}},{"$f":"IF(COLUMN()>=INDIRECT(AQ33),IF(COLUMN()<=INDIRECT(AR33),INDIRECT(AS33),\"\"),\"\")","v":{"$error":"#N/A"}},{"$f":"IF(COLUMN()>=INDIRECT(AQ33),IF(COLUMN()<=INDIRECT(AR33),INDIRECT(AS33),\"\"),\"\")","v":{"$error":"#N/A"}},{"$f":"IF(COLUMN()>=INDIRECT(AQ33),IF(COLUMN()<=INDIRECT(AR33),INDIRECT(AS33),\"\"),\"\")","v":{"$error":"#N/A"}},{"$f":"IF(COLUMN()>=INDIRECT(AQ33),IF(COLUMN()<=INDIRECT(AR33),INDIRECT(AS33),\"\"),\"\")","v":{"$error":"#N/A"}},{"$f":"IF(COLUMN()>=INDIRECT(AQ33),IF(COLUMN()<=INDIRECT(AR33),INDIRECT(AS33),\"\"),\"\")","v":{"$error":"#N/A"}},{"$f":"IF(COLUMN()>=INDIRECT(AQ33),IF(COLUMN()<=INDIRECT(AR33),INDIRECT(AS33),\"\"),\"\")","v":{"$error":"#N/A"}},{"$f":"IF(COLUMN()>=INDIRECT(AQ33),IF(COLUMN()<=INDIRECT(AR33),INDIRECT(AS33),\"\"),\"\")","v":{"$error":"#N/A"}},{"$f":"IF(COLUMN()>=INDIRECT(AQ33),IF(COLUMN()<=INDIRECT(AR33),INDIRECT(AS33),\"\"),\"\")","v":{"$error":"#N/A"}},{"$f":"IF(COLUMN()>=INDIRECT(AQ33),IF(COLUMN()<=INDIRECT(AR33),INDIRECT(AS33),\"\"),\"\")","v":{"$error":"#N/A"}},{"$f":"IF(COLUMN()>=INDIRECT(AQ33),IF(COLUMN()<=INDIRECT(AR33),INDIRECT(AS33),\"\"),\"\")","v":{"$error":"#N/A"}},{"$f":"IF(COLUMN()>=INDIRECT(AQ33),IF(COLUMN()<=INDIRECT(AR33),INDIRECT(AS33),\"\"),\"\")","v":{"$error":"#N/A"}},{"$f":"IF(COLUMN()>=INDIRECT(AQ33),IF(COLUMN()<=INDIRECT(AR33),INDIRECT(AS33),\"\"),\"\")","v":{"$error":"#N/A"}},{"$f":"IF(COLUMN()>=INDIRECT(AQ33),IF(COLUMN()<=INDIRECT(AR33),INDIRECT(AS33),\"\"),\"\")","v":{"$error":"#N/A"}},{"$f":"IF(COLUMN()>=INDIRECT(AQ33),IF(COLUMN()<=INDIRECT(AR33),INDIRECT(AS33),\"\"),\"\")","v":{"$error":"#N/A"}},{"$f":"IF(COLUMN()>=INDIRECT(AQ33),IF(COLUMN()<=INDIRECT(AR33),INDIRECT(AS33),\"\"),\"\")","v":{"$error":"#N/A"}},{"$f":"IF(COLUMN()>=INDIRECT(AQ33),IF(COLUMN()<=INDIRECT(AR33),INDIRECT(AS33),\"\"),\"\")","v":{"$error":"#N/A"}},{"$f":"IF(COLUMN()>=INDIRECT(AQ33),IF(COLUMN()<=INDIRECT(AR33),INDIRECT(AS33),\"\"),\"\")","v":{"$error":"#N/A"}},{"$f":"IF(COLUMN()>=INDIRECT(AQ33),IF(COLUMN()<=INDIRECT(AR33),INDIRECT(AS33),\"\"),\"\")","v":{"$error":"#N/A"}},{"$f":"IF(COLUMN()>=INDIRECT(AQ33),IF(COLUMN()<=INDIRECT(AR33),INDIRECT(AS33),\"\"),\"\")","v":{"$error":"#N/A"}},{"$f":"IF(COLUMN()>=INDIRECT(AQ33),IF(COLUMN()<=INDIRECT(AR33),INDIRECT(AS33),\"\"),\"\")","v":{"$error":"#N/A"}},{"$f":"IF(COLUMN()>=INDIRECT(AQ33),IF(COLUMN()<=INDIRECT(AR33),INDIRECT(AS33),\"\"),\"\")","v":{"$error":"#N/A"}},{"$f":"IF(COLUMN()>=INDIRECT(AQ33),IF(COLUMN()<=INDIRECT(AR33),INDIRECT(AS33),\"\"),\"\")","v":{"$error":"#N/A"}},{"$f":"IF(COLUMN()>=INDIRECT(AQ33),IF(COLUMN()<=INDIRECT(AR33),INDIRECT(AS33),\"\"),\"\")","v":{"$error":"#N/A"}},{"$f":"IF(COLUMN()>=INDIRECT(AQ33),IF(COLUMN()<=INDIRECT(AR33),INDIRECT(AS33),\"\"),\"\")","v":{"$error":"#N/A"}},{"$f":"IF(COLUMN()>=INDIRECT(AQ33),IF(COLUMN()<=INDIRECT(AR33),INDIRECT(AS33),\"\"),\"\")","v":{"$error":"#N/A"}},{"$f":"IF(COLUMN()>=INDIRECT(AQ33),IF(COLUMN()<=INDIRECT(AR33),INDIRECT(AS33),\"\"),\"\")","v":{"$error":"#N/A"}},{"$f":"IF(COLUMN()>=INDIRECT(AQ33),IF(COLUMN()<=INDIRECT(AR33),INDIRECT(AS33),\"\"),\"\")","v":{"$error":"#N/A"}},{"$f":"IF(COLUMN()>=INDIRECT(AQ33),IF(COLUMN()<=INDIRECT(AR33),INDIRECT(AS33),\"\"),\"\")","v":{"$error":"#N/A"}},{"$f":"IF(COLUMN()>=INDIRECT(AQ33),IF(COLUMN()<=INDIRECT(AR33),INDIRECT(AS33),\"\"),\"\")","v":{"$error":"#N/A"}},{"$f":"IF(COLUMN()>=INDIRECT(AQ33),IF(COLUMN()<=INDIRECT(AR33),INDIRECT(AS33),\"\"),\"\")","v":{"$error":"#N/A"}},{"$f":"IF(COLUMN()>=INDIRECT(AQ33),IF(COLUMN()<=INDIRECT(AR33),INDIRECT(AS33),\"\"),\"\")","v":{"$error":"#N/A"}},{"$f":"IF(COLUMN()>=INDIRECT(AQ33),IF(COLUMN()<=INDIRECT(AR33),INDIRECT(AS33),\"\"),\"\")","v":{"$error":"#N/A"}},{"$f":"IF(COLUMN()>=INDIRECT(AQ33),IF(COLUMN()<=INDIRECT(AR33),INDIRECT(AS33),\"\"),\"\")","v":{"$error":"#N/A"}},{"$f":"IF(COLUMN()>=INDIRECT(AQ33),IF(COLUMN()<=INDIRECT(AR33),INDIRECT(AS33),\"\"),\"\")","v":{"$error":"#N/A"}},{"$f":"IF(COLUMN()>=INDIRECT(AQ33),IF(COLUMN()<=INDIRECT(AR33),INDIRECT(AS33),\"\"),\"\")","v":{"$error":"#N/A"}},null,{"$f":"CONCATENATE(\"'\",SUBSTITUTE(SUBSTITUTE(SUBSTITUTE(MID(CELL(\"direccion\",'ETAPA III.a'!M$1),FIND(\"]\",CELL(\"direccion\",'ETAPA III.a'!M$1))+1,LEN(CELL(\"direccion\",'ETAPA III.a'!M$1))),\"$\",\"\"),1,MATCH($A30,'ETAPA III.a'!$K:$K,0)),\"!\",\"!$\"))","v":"'ETAPA III.a'!$M148"},{"$f":"CONCATENATE(\"'\",SUBSTITUTE(SUBSTITUTE(SUBSTITUTE(MID(CELL(\"direccion\",'ETAPA III.a'!N$1),FIND(\"]\",CELL(\"direccion\",'ETAPA III.a'!N$1))+1,LEN(CELL(\"direccion\",'ETAPA III.a'!N$1))),\"$\",\"\"),1,MATCH($A30,'ETAPA III.a'!$K:$K,0)),\"!\",\"!$\"))","v":"'ETAPA III.a'!$N148"},{"$f":"CONCATENATE(\"'\",SUBSTITUTE(SUBSTITUTE(SUBSTITUTE(MID(CELL(\"direccion\",'ETAPA III.a'!L$1),FIND(\"]\",CELL(\"direccion\",'ETAPA III.a'!L$1))+1,LEN(CELL(\"direccion\",'ETAPA III.a'!L$1))),\"$\",\"\"),1,MATCH($A30,'ETAPA III.a'!$K:$K,0)),\"!\",\"!$\"))","v":"'ETAPA III.a'!$L148"}]
[21,{"$f":"IF(COLUMN()>=INDIRECT(AQ34),IF(COLUMN()<=INDIRECT(AR34),INDIRECT(AS34),\"\"),\"\")","v":{"$error":"#N/A"}},{"$f":"IF(COLUMN()>=INDIRECT(AQ34),IF(COLUMN()<=INDIRECT(AR34),INDIRECT(AS34),\"\"),\"\")","v":{"$error":"#N/A"}},{"$f":"IF(COLUMN()>=INDIRECT(AQ34),IF(COLUMN()<=INDIRECT(AR34),INDIRECT(AS34),\"\"),\"\")","v":{"$error":"#N/A"}},{"$f":"IF(COLUMN()>=INDIRECT(AQ34),IF(COLUMN()<=INDIRECT(AR34),INDIRECT(AS34),\"\"),\"\")","v":{"$error":"#N/A"}},{"$f":"IF(COLUMN()>=INDIRECT(AQ34),IF(COLUMN()<=INDIRECT(AR34),INDIRECT(AS34),\"\"),\"\")","v":{"$error":"#N/A"}},{"$f":"IF(COLUMN()>=INDIRECT(AQ34),IF(COLUMN()<=INDIRECT(AR34),INDIRECT(AS34),\"\"),\"\")","v":{"$error":"#N/A"}},{"$f":"IF(COLUMN()>=INDIRECT(AQ34),IF(COLUMN()<=INDIRECT(AR34),INDIRECT(AS34),\"\"),\"\")","v":{"$error":"#N/A"}},{"$f":"IF(COLUMN()>=INDIRECT(AQ34),IF(COLUMN()<=INDIRECT(AR34),INDIRECT(AS34),\"\"),\"\")","v":{"$error":"#N/A"}},{"$f":"IF(COLUMN()>=INDIRECT(AQ34),IF(COLUMN()<=INDIRECT(AR34),INDIRECT(AS34),\"\"),\"\")","v":{"$error":"#N/A"}},{"$f":"IF(COLUMN()>=INDIRECT(AQ34),IF(COLUMN()<=INDIRECT(AR34),INDIRECT(AS34),\"\"),\"\")","v":{"$error":"#N/A"}},{"$f":"IF(COLUMN()>=INDIRECT(AQ34),IF(COLUMN()<=INDIRECT(AR34),INDIRECT(AS34),\"\"),\"\")","v":{"$error":"#N/A"}},{"$f":"IF(COLUMN()>=INDIRECT(AQ34),IF(COLUMN()<=INDIRECT(AR34),INDIRECT(AS34),\"\"),\"\")","v":{"$error":"#N/A"}},{"$f":"IF(COLUMN()>=INDIRECT(AQ34),IF(COLUMN()<=INDIRECT(AR34),INDIRECT(AS34),\"\"),\"\")","v":{"$error":"#N/A"}},{"$f":"IF(COLUMN()>=INDIRECT(AQ34),IF(COLUMN()<=INDIRECT(AR34),INDIRECT(AS34),\"\"),\"\")","v":{"$error":"#N/A"}},{"$f":"IF(COLUMN()>=INDIRECT(AQ34),IF(COLUMN()<=INDIRECT(AR34),INDIRECT(AS34),\"\"),\"\")","v":{"$error":"#N/A"}},{"$f":"IF(COLUMN()>=INDIRECT(AQ34),IF(COLUMN()<=INDIRECT(AR34),INDIRECT(AS34),\"\"),\"\")","v":{"$error":"#N/A"}},{"$f":"IF(COLUMN()>=INDIRECT(AQ34),IF(COLUMN()<=INDIRECT(AR34),INDIRECT(AS34),\"\"),\"\")","v":{"$error":"#N/A"}},{"$f":"IF(COLUMN()>=INDIRECT(AQ34),IF(COLUMN()<=INDIRECT(AR34),INDIRECT(AS34),\"\"),\"\")","v":{"$error":"#N/A"}},{"$f":"IF(COLUMN()>=INDIRECT(AQ34),IF(COLUMN()<=INDIRECT(AR34),INDIRECT(AS34),\"\"),\"\")","v":{"$error":"#N/A"}},{"$f":"IF(COLUMN()>=INDIRECT(AQ34),IF(COLUMN()<=INDIRECT(AR34),INDIRECT(AS34),\"\"),\"\")","v":{"$error":"#N/A"}},{"$f":"IF(COLUMN()>=INDIRECT(AQ34),IF(COLUMN()<=INDIRECT(AR34),INDIRECT(AS34),\"\"),\"\")","v":{"$error":"#N/A"}},{"$f":"IF(COLUMN()>=INDIRECT(AQ34),IF(COLUMN()<=INDIRECT(AR34),INDIRECT(AS34),\"\"),\"\")","v":{"$error":"#N/A"}},{"$f":"IF(COLUMN()>=INDIRECT(AQ34),IF(COLUMN()<=INDIRECT(AR34),INDIRECT(AS34),\"\"),\"\")","v":{"$error":"#N/A"}},{"$f":"IF(COLUMN()>=INDIRECT(AQ34),IF(COLUMN()<=INDIRECT(AR34),INDIRECT(AS34),\"\"),\"\")","v":{"$error":"#N/A"}},{"$f":"IF(COLUMN()>=INDIRECT(AQ34),IF(COLUMN()<=INDIRECT(AR34),INDIRECT(AS34),\"\"),\"\")","v":{"$error":"#N/A"}},{"$f":"IF(COLUMN()>=INDIRECT(AQ34),IF(COLUMN()<=INDIRECT(AR34),INDIRECT(AS34),\"\"),\"\")","v":{"$error":"#N/A"}},{"$f":"IF(COLUMN()>=INDIRECT(AQ34),IF(COLUMN()<=INDIRECT(AR34),INDIRECT(AS34),\"\"),\"\")","v":{"$error":"#N/A"}},{"$f":"IF(COLUMN()>=INDIRECT(AQ34),IF(COLUMN()<=INDIRECT(AR34),INDIRECT(AS34),\"\"),\"\")","v":{"$error":"#N/A"}},{"$f":"IF(COLUMN()>=INDIRECT(AQ34),IF(COLUMN()<=INDIRECT(AR34),INDIRECT(AS34),\"\"),\"\")","v":{"$error":"#N/A"}},{"$f":"IF(COLUMN()>=INDIRECT(AQ34),IF(COLUMN()<=INDIRECT(AR34),INDIRECT(AS34),\"\"),\"\")","v":{"$error":"#N/A"}},{"$f":"IF(COLUMN()>=INDIRECT(AQ34),IF(COLUMN()<=INDIRECT(AR34),INDIRECT(AS34),\"\"),\"\")","v":{"$error":"#N/A"}},{"$f":"IF(COLUMN()>=INDIRECT(AQ34),IF(COLUMN()<=INDIRECT(AR34),INDIRECT(AS34),\"\"),\"\")","v":{"$error":"#N/A"}},{"$f":"IF(COLUMN()>=INDIRECT(AQ34),IF(COLUMN()<=INDIRECT(AR34),INDIRECT(AS34),\"\"),\"\")","v":{"$error":"#N/A"}},{"$f":"IF(COLUMN()>=INDIRECT(AQ34),IF(COLUMN()<=INDIRECT(AR34),INDIRECT(AS34),\"\"),\"\")","v":{"$error":"#N/A"}},{"$f":"IF(COLUMN()>=INDIRECT(AQ34),IF(COLUMN()<=INDIRECT(AR34),INDIRECT(AS34),\"\"),\"\")","v":{"$error":"#N/A"}},{"$f":"IF(COLUMN()>=INDIRECT(AQ34),IF(COLUMN()<=INDIRECT(AR34),INDIRECT(AS34),\"\"),\"\")","v":{"$error":"#N/A"}},{"$f":"IF(COLUMN()>=INDIRECT(AQ34),IF(COLUMN()<=INDIRECT(AR34),INDIRECT(AS34),\"\"),\"\")","v":{"$error":"#N/A"}},{"$f":"IF(COLUMN()>=INDIRECT(AQ34),IF(COLUMN()<=INDIRECT(AR34),INDIRECT(AS34),\"\"),\"\")","v":{"$error":"#N/A"}},{"$f":"IF(COLUMN()>=INDIRECT(AQ34),IF(COLUMN()<=INDIRECT(AR34),INDIRECT(AS34),\"\"),\"\")","v":{"$error":"#N/A"}},{"$f":"IF(COLUMN()>=INDIRECT(AQ34),IF(COLUMN()<=INDIRECT(AR34),INDIRECT(AS34),\"\"),\"\")","v":{"$error":"#N/A"}},null,{"$f":"CONCATENATE(\"'\",SUBSTITUTE(SUBSTITUTE(SUBSTITUTE(MID(CELL(\"direccion\",'ETAPA III.a'!M$1),FIND(\"]\",CELL(\"direccion\",'ETAPA III.a'!M$1))+1,LEN(CELL(\"direccion\",'ETAPA III.a'!M$1))),\"$\",\"\"),1,MATCH($A31,'ETAPA III.a'!$K:$K,0)),\"!\",\"!$\"))","v":"'ETAPA III.a'!$M155"},{"$f":"CONCATENATE(\"'\",SUBSTITUTE(SUBSTITUTE(SUBSTITUTE(MID(CELL(\"direccion\",'ETAPA III.a'!N$1),FIND(\"]\",CELL(\"direccion\",'ETAPA III.a'!N$1))+1,LEN(CELL(\"direccion\",'ETAPA III.a'!N$1))),\"$\",\"\"),1,MATCH($A31,'ETAPA III.a'!$K:$K,0)),\"!\",\"!$\"))","v":"'ETAPA III.a'!$N155"},{"$f":"CONCATENATE(\"'\",SUBSTITUTE(SUBSTITUTE(SUBSTITUTE(MID(CELL(\"direccion\",'ETAPA III.a'!L$1),FIND(\"]\",CELL(\"direccion\",'ETAPA III.a'!L$1))+1,LEN(CELL(\"direccion\",'ETAPA III.a'!L$1))),\"$\",\"\"),1,MATCH($A31,'ETAPA III.a'!$K:$K,0)),\"!\",\"!$\"))","v":"'ETAPA III.a'!$L155"}]
[22,{"$f":"IF(COLUMN()>=INDIRECT(AQ35),IF(COLUMN()<=INDIRECT(AR35),INDIRECT(AS35),\"\"),\"\")","v":{"$error":"#N/A"}},{"$f":"IF(COLUMN()>=INDIRECT(AQ35),IF(COLUMN()<=INDIRECT(AR35),INDIRECT(AS35),\"\"),\"\")","v":{"$error":"#N/A"}},{"$f":"IF(COLUMN()>=INDIRECT(AQ35),IF(COLUMN()<=INDIRECT(AR35),INDIRECT(AS35),\"\"),\"\")","v":{"$error":"#N/A"}},{"$f":"IF(COLUMN()>=INDIRECT(AQ35),IF(COLUMN()<=INDIRECT(AR35),INDIRECT(AS35),\"\"),\"\")","v":{"$error":"#N/A"}},{"$f":"IF(COLUMN()>=INDIRECT(AQ35),IF(COLUMN()<=INDIRECT(AR35),INDIRECT(AS35),\"\"),\"\")","v":{"$error":"#N/A"}},{"$f":"IF(COLUMN()>=INDIRECT(AQ35),IF(COLUMN()<=INDIRECT(AR35),INDIRECT(AS35),\"\"),\"\")","v":{"$error":"#N/A"}},{"$f":"IF(COLUMN()>=INDIRECT(AQ35),IF(COLUMN()<=INDIRECT(AR35),INDIRECT(AS35),\"\"),\"\")","v":{"$error":"#N/A"}},{"$f":"IF(COLUMN()>=INDIRECT(AQ35),IF(COLUMN()<=INDIRECT(AR35),INDIRECT(AS35),\"\"),\"\")","v":{"$error":"#N/A"}},{"$f":"IF(COLUMN()>=INDIRECT(AQ35),IF(COLUMN()<=INDIRECT(AR35),INDIRECT(AS35),\"\"),\"\")","v":{"$error":"#N/A"}},{"$f":"IF(COLUMN()>=INDIRECT(AQ35),IF(COLUMN()<=INDIRECT(AR35),INDIRECT(AS35),\"\"),\"\")","v":{"$error":"#N/A"}},{"$f":"IF(COLUMN()>=INDIRECT(AQ35),IF(COLUMN()<=INDIRECT(AR35),INDIRECT(AS35),\"\"),\"\")","v":{"$error":"#N/A"}},{"$f":"IF(COLUMN()>=INDIRECT(AQ35),IF(COLUMN()<=INDIRECT(AR35),INDIRECT(AS35),\"\"),\"\")","v":{"$error":"#N/A"}},{"$f":"IF(COLUMN()>=INDIRECT(AQ35),IF(COLUMN()<=INDIRECT(AR35),INDIRECT(AS35),\"\"),\"\")","v":{"$error":"#N/A"}},{"$f":"IF(COLUMN()>=INDIRECT(AQ35),IF(COLUMN()<=INDIRECT(AR35),INDIRECT(AS35),\"\"),\"\")","v":{"$error":"#N/A"}},{"$f":"IF(COLUMN()>=INDIRECT(AQ35),IF(COLUMN()<=INDIRECT(AR35),INDIRECT(AS35),\"\"),\"\")","v":{"$error":"#N/A"}},{"$f":"IF(COLUMN()>=INDIRECT(AQ35),IF(COLUMN()<=INDIRECT(AR35),INDIRECT(AS35),\"\"),\"\")","v":{"$error":"#N/A"}},{"$f":"IF(COLUMN()>=INDIRECT(AQ35),IF(COLUMN()<=INDIRECT(AR35),INDIRECT(AS35),\"\"),\"\")","v":{"$error":"#N/A"}},{"$f":"IF(COLUMN()>=INDIRECT(AQ35),IF(COLUMN()<=INDIRECT(AR35),INDIRECT(AS35),\"\"),\"\")","v":{"$error":"#N/A"}},{"$f":"IF(COLUMN()>=INDIRECT(AQ35),IF(COLUMN()<=INDIRECT(AR35),INDIRECT(AS35),\"\"),\"\")","v":{"$error":"#N/A"}},{"$f":"IF(COLUMN()>=INDIRECT(AQ35),IF(COLUMN()<=INDIRECT(AR35),INDIRECT(AS35),\"\"),\"\")","v":{"$error":"#N/A"}},{"$f":"IF(COLUMN()>=INDIRECT(AQ35),IF(COLUMN()<=INDIRECT(AR35),INDIRECT(AS35),\"\"),\"\")","v":{"$error":"#N/A"}},{"$f":"IF(COLUMN()>=INDIRECT(AQ35),IF(COLUMN()<=INDIRECT(AR35),INDIRECT(AS35),\"\"),\"\")","v":{"$error":"#N/A"}},{"$f":"IF(COLUMN()>=INDIRECT(AQ35),IF(COLUMN()<=INDIRECT(AR35),INDIRECT(AS35),\"\"),\"\")","v":{"$error":"#N/A"}},{"$f":"IF(COLUMN()>=INDIRECT(AQ35),IF(COLUMN()<=INDIRECT(AR35),INDIRECT(AS35),\"\"),\"\")","v":{"$error":"#N/A"}},{"$f":"IF(COLUMN()>=INDIRECT(AQ35),IF(COLUMN()<=INDIRECT(AR35),INDIRECT(AS35),\"\"),\"\")","v":{"$error":"#N/A"}},{"$f":"IF(COLUMN()>=INDIRECT(AQ35),IF(COLUMN()<=INDIRECT(AR35),INDIRECT(AS35),\"\"),\"\")","v":{"$error":"#N/A"}},{"$f":"IF(COLUMN()>=INDIRECT(AQ35),IF(COLUMN()<=INDIRECT(AR35),INDIRECT(AS35),\"\"),\"\")","v":{"$error":"#N/A"}},{"$f":"IF(COLUMN()>=INDIRECT(AQ35),IF(COLUMN()<=INDIRECT(AR35),INDIRECT(AS35),\"\"),\"\")","v":{"$error":"#N/A"}},{"$f":"IF(COLUMN()>=INDIRECT(AQ35),IF(COLUMN()<=INDIRECT(AR35),INDIRECT(AS35),\"\"),\"\")","v":{"$error":"#N/A"}},{"$f":"IF(COLUMN()>=INDIRECT(AQ35),IF(COLUMN()<=INDIRECT(AR35),INDIRECT(AS35),\"\"),\"\")","v":{"$error":"#N/A"}},{"$f":"IF(COLUMN()>=INDIRECT(AQ35),IF(COLUMN()<=INDIRECT(AR35),INDIRECT(AS35),\"\"),\"\")","v":{"$error":"#N/A"}},{"$f":"IF(COLUMN()>=INDIRECT(AQ35),IF(COLUMN()<=INDIRECT(AR35),INDIRECT(AS35),\"\"),\"\")","v":{"$error":"#N/A"}},{"$f":"IF(COLUMN()>=INDIRECT(AQ35),IF(COLUMN()<=INDIRECT(AR35),INDIRECT(AS35),\"\"),\"\")","v":{"$error":"#N/A"}},{"$f":"IF(COLUMN()>=INDIRECT(AQ35),IF(COLUMN()<=INDIRECT(AR35),INDIRECT(AS35),\"\"),\"\")","v":{"$error":"#N/A"}},{"$f":"IF(COLUMN()>=INDIRECT(AQ35),IF(COLUMN()<=INDIRECT(AR35),INDIRECT(AS35),\"\"),\"\")","v":{"$error":"#N/A"}},{"$f":"IF(COLUMN()>=INDIRECT(AQ35),IF(COLUMN()<=INDIRECT(AR35),INDIRECT(AS35),\"\"),\"\")","v":{"$error":"#N/A"}},{"$f":"IF(COLUMN()>=INDIRECT(AQ35),IF(COLUMN()<=INDIRECT(AR35),INDIRECT(AS35),\"\"),\"\")","v":{"$error":"#N/A"}},{"$f":"IF(COLUMN()>=INDIRECT(AQ35),IF(COLUMN()<=INDIRECT(AR35),INDIRECT(AS35),\"\"),\"\")","v":{"$error":"#N/A"}},{"$f":"IF(COLUMN()>=INDIRECT(AQ35),IF(COLUMN()<=INDIRECT(AR35),INDIRECT(AS35),\"\"),\"\")","v":{"$error":"#N/A"}},{"$f":"IF(COLUMN()>=INDIRECT(AQ35),IF(COLUMN()<=INDIRECT(AR35),INDIRECT(AS35),\"\"),\"\")","v":{"$error":"#N/A"}},null,{"$f":"CONCATENATE(\"'\",SUBSTITUTE(SUBSTITUTE(SUBSTITUTE(MID(CELL(\"direccion\",'ETAPA III.a'!M$1),FIND(\"]\",CELL(\"direccion\",'ETAPA III.a'!M$1))+1,LEN(CELL(\"direccion\",'ETAPA III.a'!M$1))),\"$\",\"\"),1,MATCH($A32,'ETAPA III.a'!$K:$K,0)),\"!\",\"!$\"))","v":"'ETAPA III.a'!$M162"},{"$f":"CONCATENATE(\"'\",SUBSTITUTE(SUBSTITUTE(SUBSTITUTE(MID(CELL(\"direccion\",'ETAPA III.a'!N$1),FIND(\"]\",CELL(\"direccion\",'ETAPA III.a'!N$1))+1,LEN(CELL(\"direccion\",'ETAPA III.a'!N$1))),\"$\",\"\"),1,MATCH($A32,'ETAPA III.a'!$K:$K,0)),\"!\",\"!$\"))","v":"'ETAPA III.a'!$N162"},{"$f":"CONCATENATE(\"'\",SUBSTITUTE(SUBSTITUTE(SUBSTITUTE(MID(CELL(\"direccion\",'ETAPA III.a'!L$1),FIND(\"]\",CELL(\"direccion\",'ETAPA III.a'!L$1))+1,LEN(CELL(\"direccion\",'ETAPA III.a'!L$1))),\"$\",\"\"),1,MATCH($A32,'ETAPA III.a'!$K:$K,0)),\"!\",\"!$\"))","v":"'ETAPA III.a'!$L162"}]
[23,{"$f":"IF(COLUMN()>=INDIRECT(AQ36),IF(COLUMN()<=INDIRECT(AR36),INDIRECT(AS36),\"\"),\"\")","v":{"$error":"#N/A"}},{"$f":"IF(COLUMN()>=INDIRECT(AQ36),IF(COLUMN()<=INDIRECT(AR36),INDIRECT(AS36),\"\"),\"\")","v":{"$error":"#N/A"}},{"$f":"IF(COLUMN()>=INDIRECT(AQ36),IF(COLUMN()<=INDIRECT(AR36),INDIRECT(AS36),\"\"),\"\")","v":{"$error":"#N/A"}},{"$f":"IF(COLUMN()>=INDIRECT(AQ36),IF(COLUMN()<=INDIRECT(AR36),INDIRECT(AS36),\"\"),\"\")","v":{"$error":"#N/A"}},{"$f":"IF(COLUMN()>=INDIRECT(AQ36),IF(COLUMN()<=INDIRECT(AR36),INDIRECT(AS36),\"\"),\"\")","v":{"$error":"#N/A"}},{"$f":"IF(COLUMN()>=INDIRECT(AQ36),IF(COLUMN()<=INDIRECT(AR36),INDIRECT(AS36),\"\"),\"\")","v":{"$error":"#N/A"}},{"$f":"IF(COLUMN()>=INDIRECT(AQ36),IF(COLUMN()<=INDIRECT(AR36),INDIRECT(AS36),\"\"),\"\")","v":{"$error":"#N/A"}},{"$f":"IF(COLUMN()>=INDIRECT(AQ36),IF(COLUMN()<=INDIRECT(AR36),INDIRECT(AS36),\"\"),\"\")","v":{"$error":"#N/A"}},{"$f":"IF(COLUMN()>=INDIRECT(AQ36),IF(COLUMN()<=INDIRECT(AR36),INDIRECT(AS36),\"\"),\"\")","v":{"$error":"#N/A"}},{"$f":"IF(COLUMN()>=INDIRECT(AQ36),IF(COLUMN()<=INDIRECT(AR36),INDIRECT(AS36),\"\"),\"\")","v":{"$error":"#N/A"}},{"$f":"IF(COLUMN()>=INDIRECT(AQ36),IF(COLUMN()<=INDIRECT(AR36),INDIRECT(AS36),\"\"),\"\")","v":{"$error":"#N/A"}},{"$f":"IF(COLUMN()>=INDIRECT(AQ36),IF(COLUMN()<=INDIRECT(AR36),INDIRECT(AS36),\"\"),\"\")","v":{"$error":"#N/A"}},{"$f":"IF(COLUMN()>=INDIRECT(AQ36),IF(COLUMN()<=INDIRECT(AR36),INDIRECT(AS36),\"\"),\"\")","v":{"$error":"#N/A"}},{"$f":"IF(COLUMN()>=INDIRECT(AQ36),IF(COLUMN()<=INDIRECT(AR36),INDIRECT(AS36),\"\"),\"\")","v":{"$error":"#N/A"}},{"$f":"IF(COLUMN()>=INDIRECT(AQ36),IF(COLUMN()<=INDIRECT(AR36),INDIRECT(AS36),\"\"),\"\")","v":{"$error":"#N/A"}},{"$f":"IF(COLUMN()>=INDIRECT(AQ36),IF(COLUMN()<=INDIRECT(AR36),INDIRECT(AS36),\"\"),\"\")","v":{"$error":"#N/A"}},{"$f":"IF(COLUMN()>=INDIRECT(AQ36),IF(COLUMN()<=INDIRECT(AR36),INDIRECT(AS36),\"\"),\"\")","v":{"$error":"#N/A"}},{"$f":"IF(COLUMN()>=INDIRECT(AQ36),IF(COLUMN()<=INDIRECT(AR36),INDIRECT(AS36),\"\"),\"\")","v":{"$error":"#N/A"}},{"$f":"IF(COLUMN()>=INDIRECT(AQ36),IF(COLUMN()<=INDIRECT(AR36),INDIRECT(AS36),\"\"),\"\")","v":{"$error":"#N/A"}},{"$f":"IF(COLUMN()>=INDIRECT(AQ36),IF(COLUMN()<=INDIRECT(AR36),INDIRECT(AS36),\"\"),\"\")","v":{"$error":"#N/A"}},{"$f":"IF(COLUMN()>=INDIRECT(AQ36),IF(COLUMN()<=INDIRECT(AR36),INDIRECT(AS36),\"\"),\"\")","v":{"$error":"#N/A"}},{"$f":"IF(COLUMN()>=INDIRECT(AQ36),IF(COLUMN()<=INDIRECT(AR36),INDIRECT(AS36),\"\"),\"\")","v":{"$error":"#N/A"}},{"$f":"IF(COLUMN()>=INDIRECT(AQ36),IF(COLUMN()<=INDIRECT(AR36),INDIRECT(AS36),\"\"),\"\")","v":{"$error":"#N/A"}},{"$f":"IF(COLUMN()>=INDIRECT(AQ36),IF(COLUMN()<=INDIRECT(AR36),INDIRECT(AS36),\"\"),\"\")","v":{"$error":"#N/A"}},{"$f":"IF(COLUMN()>=INDIRECT(AQ36),IF(COLUMN()<=INDIRECT(AR36),INDIRECT(AS36),\"\"),\"\")","v":{"$error":"#N/A"}},{"$f":"IF(COLUMN()>=INDIRECT(AQ36),IF(COLUMN()<=INDIRECT(AR36),INDIRECT(AS36),\"\"),\"\")","v":{"$error":"#N/A"}},{"$f":"IF(COLUMN()>=INDIRECT(AQ36),IF(COLUMN()<=INDIRECT(AR36),INDIRECT(AS36),\"\"),\"\")","v":{"$error":"#N/A"}},{"$f":"IF(COLUMN()>=INDIRECT(AQ36),IF(COLUMN()<=INDIRECT(AR36),INDIRECT(AS36),\"\"),\"\")","v":{"$error":"#N/A"}},{"$f":"IF(COLUMN()>=INDIRECT(AQ36),IF(COLUMN()<=INDIRECT(AR36),INDIRECT(AS36),\"\"),\"\")","v":{"$error":"#N/A"}},{"$f":"IF(COLUMN()>=INDIRECT(AQ36),IF(COLUMN()<=INDIRECT(AR36),INDIRECT(AS36),\"\"),\"\")","v":{"$error":"#N/A"}},{"$f":"IF(COLUMN()>=INDIRECT(AQ36),IF(COLUMN()<=INDIRECT(AR36),INDIRECT(AS36),\"\"),\"\")","v":{"$error":"#N/A"}},{"$f":"IF(COLUMN()>=INDIRECT(AQ36),IF(COLUMN()<=INDIRECT(AR36),INDIRECT(AS36),\"\"),\"\")","v":{"$error":"#N/A"}},{"$f":"IF(COLUMN()>=INDIRECT(AQ36),IF(COLUMN()<=INDIRECT(AR36),INDIRECT(AS36),\"\"),\"\")","v":{"$error":"#N/A"}},{"$f":"IF(COLUMN()>=INDIRECT(AQ36),IF(COLUMN()<=INDIRECT(AR36),INDIRECT(AS36),\"\"),\"\")","v":{"$error":"#N/A"}},{"$f":"IF(COLUMN()>=INDIRECT(AQ36),IF(COLUMN()<=INDIRECT(AR36),INDIRECT(AS36),\"\"),\"\")","v":{"$error":"#N/A"}},{"$f":"IF(COLUMN()>=INDIRECT(AQ36),IF(COLUMN()<=INDIRECT(AR36),INDIRECT(AS36),\"\"),\"\")","v":{"$error":"#N/A"}},{"$f":"IF(COLUMN()>=INDIRECT(AQ36),IF(COLUMN()<=INDIRECT(AR36),INDIRECT(AS36),\"\"),\"\")","v":{"$error":"#N/A"}},{"$f":"IF(COLUMN()>=INDIRECT(AQ36),IF(COLUMN()<=INDIRECT(AR36),INDIRECT(AS36),\"\"),\"\")","v":{"$error":"#N/A"}},{"$f":"IF(COLUMN()>=INDIRECT(AQ36),IF(COLUMN()<=INDIRECT(AR36),INDIRECT(AS36),\"\"),\"\")","v":{"$error":"#N/A"}},{"$f":"IF(COLUMN()>=INDIRECT(AQ36),IF(COLUMN()<=INDIRECT(AR36),INDIRECT(AS36),\"\"),\"\")","v":{"$error":"#N/A"}},null,{"$f":"CONCATENATE(\"'\",SUBSTITUTE(SUBSTITUTE(SUBSTITUTE(MID(CELL(\"direccion\",'ETAPA III.a'!M$1),FIND(\"]\",CELL(\"direccion\",'ETAPA III.a'!M$1))+1,LEN(CELL(\"direccion\",'ETAPA III.a'!M$1))),\"$\",\"\"),1,MATCH($A33,'ETAPA III.a'!$K:$K,0)),\"!\",\"!$\"))","v":"'ETAPA III.a'!$M169"},{"$f":"CONCATENATE(\"'\",SUBSTITUTE(SUBSTITUTE(SUBSTITUTE(MID(CELL(\"direccion\",'ETAPA III.a'!N$1),FIND(\"]\",CELL(\"direccion\",'ETAPA III.a'!N$1))+1,LEN(CELL(\"direccion\",'ETAPA III.a'!N$1))),\"$\",\"\"),1,MATCH($A33,'ETAPA III.a'!$K:$K,0)),\"!\",\"!$\"))","v":"'ETAPA III.a'!$N169"},{"$f":"CONCATENATE(\"'\",SUBSTITUTE(SUBSTITUTE(SUBSTITUTE(MID(CELL(\"direccion\",'ETAPA III.a'!L$1),FIND(\"]\",CELL(\"direccion\",'ETAPA III.a'!L$1))+1,LEN(CELL(\"direccion\",'ETAPA III.a'!L$1))),\"$\",\"\"),1,MATCH($A33,'ETAPA III.a'!$K:$K,0)),\"!\",\"!$\"))","v":"'ETAPA III.a'!$L169"}]
[24,{"$f":"IF(COLUMN()>=INDIRECT(AQ37),IF(COLUMN()<=INDIRECT(AR37),INDIRECT(AS37),\"\"),\"\")","v":{"$error":"#N/A"}},{"$f":"IF(COLUMN()>=INDIRECT(AQ37),IF(COLUMN()<=INDIRECT(AR37),INDIRECT(AS37),\"\"),\"\")","v":{"$error":"#N/A"}},{"$f":"IF(COLUMN()>=INDIRECT(AQ37),IF(COLUMN()<=INDIRECT(AR37),INDIRECT(AS37),\"\"),\"\")","v":{"$error":"#N/A"}},{"$f":"IF(COLUMN()>=INDIRECT(AQ37),IF(COLUMN()<=INDIRECT(AR37),INDIRECT(AS37),\"\"),\"\")","v":{"$error":"#N/A"}},{"$f":"IF(COLUMN()>=INDIRECT(AQ37),IF(COLUMN()<=INDIRECT(AR37),INDIRECT(AS37),\"\"),\"\")","v":{"$error":"#N/A"}},{"$f":"IF(COLUMN()>=INDIRECT(AQ37),IF(COLUMN()<=INDIRECT(AR37),INDIRECT(AS37),\"\"),\"\")","v":{"$error":"#N/A"}},{"$f":"IF(COLUMN()>=INDIRECT(AQ37),IF(COLUMN()<=INDIRECT(AR37),INDIRECT(AS37),\"\"),\"\")","v":{"$error":"#N/A"}},{"$f":"IF(COLUMN()>=INDIRECT(AQ37),IF(COLUMN()<=INDIRECT(AR37),INDIRECT(AS37),\"\"),\"\")","v":{"$error":"#N/A"}},{"$f":"IF(COLUMN()>=INDIRECT(AQ37),IF(COLUMN()<=INDIRECT(AR37),INDIRECT(AS37),\"\"),\"\")","v":{"$error":"#N/A"}},{"$f":"IF(COLUMN()>=INDIRECT(AQ37),IF(COLUMN()<=INDIRECT(AR37),INDIRECT(AS37),\"\"),\"\")","v":{"$error":"#N/A"}},{"$f":"IF(COLUMN()>=INDIRECT(AQ37),IF(COLUMN()<=INDIRECT(AR37),INDIRECT(AS37),\"\"),\"\")","v":{"$error":"#N/A"}},{"$f":"IF(COLUMN()>=INDIRECT(AQ37),IF(COLUMN()<=INDIRECT(AR37),INDIRECT(AS37),\"\"),\"\")","v":{"$error":"#N/A"}},{"$f":"IF(COLUMN()>=INDIRECT(AQ37),IF(COLUMN()<=INDIRECT(AR37),INDIRECT(AS37),\"\"),\"\")","v":{"$error":"#N/A"}},{"$f":"IF(COLUMN()>=INDIRECT(AQ37),IF(COLUMN()<=INDIRECT(AR37),INDIRECT(AS37),\"\"),\"\")","v":{"$error":"#N/A"}},{"$f":"IF(COLUMN()>=INDIRECT(AQ37),IF(COLUMN()<=INDIRECT(AR37),INDIRECT(AS37),\"\"),\"\")","v":{"$error":"#N/A"}},{"$f":"IF(COLUMN()>=INDIRECT(AQ37),IF(COLUMN()<=INDIRECT(AR37),INDIRECT(AS37),\"\"),\"\")","v":{"$error":"#N/A"}},{"$f":"IF(COLUMN()>=INDIRECT(AQ37),IF(COLUMN()<=INDIRECT(AR37),INDIRECT(AS37),\"\"),\"\")","v":{"$error":"#N/A"}},{"$f":"IF(COLUMN()>=INDIRECT(AQ37),IF(COLUMN()<=INDIRECT(AR37),INDIRECT(AS37),\"\"),\"\")","v":{"$error":"#N/A"}},{"$f":"IF(COLUMN()>=INDIRECT(AQ37),IF(COLUMN()<=INDIRECT(AR37),INDIRECT(AS37),\"\"),\"\")","v":{"$error":"#N/A"}},{"$f":"IF(COLUMN()>=INDIRECT(AQ37),IF(COLUMN()<=INDIRECT(AR37),INDIRECT(AS37),\"\"),\"\")","v":{"$error":"#N/A"}},{"$f":"IF(COLUMN()>=INDIRECT(AQ37),IF(COLUMN()<=INDIRECT(AR37),INDIRECT(AS37),\"\"),\"\")","v":{"$error":"#N/A"}},{"$f":"IF(COLUMN()>=INDIRECT(AQ37),IF(COLUMN()<=INDIRECT(AR37),INDIRECT(AS37),\"\"),\"\")","v":{"$error":"#N/A"}},{"$f":"IF(COLUMN()>=INDIRECT(AQ37),IF(COLUMN()<=INDIRECT(AR37),INDIRECT(AS37),\"\"),\"\")","v":{"$error":"#N/A"}},{"$f":"IF(COLUMN()>=INDIRECT(AQ37),IF(COLUMN()<=INDIRECT(AR37),INDIRECT(AS37),\"\"),\"\")","v":{"$error":"#N/A"}},{"$f":"IF(COLUMN()>=INDIRECT(AQ37),IF(COLUMN()<=INDIRECT(AR37),INDIRECT(AS37),\"\"),\"\")","v":{"$error":"#N/A"}},{"$f":"IF(COLUMN()>=INDIRECT(AQ37),IF(COLUMN()<=INDIRECT(AR37),INDIRECT(AS37),\"\"),\"\")","v":{"$error":"#N/A"}},{"$f":"IF(COLUMN()>=INDIRECT(AQ37),IF(COLUMN()<=INDIRECT(AR37),INDIRECT(AS37),\"\"),\"\")","v":{"$error":"#N/A"}},{"$f":"IF(COLUMN()>=INDIRECT(AQ37),IF(COLUMN()<=INDIRECT(AR37),INDIRECT(AS37),\"\"),\"\")","v":{"$error":"#N/A"}},{"$f":"IF(COLUMN()>=INDIRECT(AQ37),IF(COLUMN()<=INDIRECT(AR37),INDIRECT(AS37),\"\"),\"\")","v":{"$error":"#N/A"}},{"$f":"IF(COLUMN()>=INDIRECT(AQ37),IF(COLUMN()<=INDIRECT(AR37),INDIRECT(AS37),\"\"),\"\")","v":{"$error":"#N/A"}},{"$f":"IF(COLUMN()>=INDIRECT(AQ37),IF(COLUMN()<=INDIRECT(AR37),INDIRECT(AS37),\"\"),\"\")","v":{"$error":"#N/A"}},{"$f":"IF(COLUMN()>=INDIRECT(AQ37),IF(COLUMN()<=INDIRECT(AR37),INDIRECT(AS37),\"\"),\"\")","v":{"$error":"#N/A"}},{"$f":"IF(COLUMN()>=INDIRECT(AQ37),IF(COLUMN()<=INDIRECT(AR37),INDIRECT(AS37),\"\"),\"\")","v":{"$error":"#N/A"}},{"$f":"IF(COLUMN()>=INDIRECT(AQ37),IF(COLUMN()<=INDIRECT(AR37),INDIRECT(AS37),\"\"),\"\")","v":{"$error":"#N/A"}},{"$f":"IF(COLUMN()>=INDIRECT(AQ37),IF(COLUMN()<=INDIRECT(AR37),INDIRECT(AS37),\"\"),\"\")","v":{"$error":"#N/A"}},{"$f":"IF(COLUMN()>=INDIRECT(AQ37),IF(COLUMN()<=INDIRECT(AR37),INDIRECT(AS37),\"\"),\"\")","v":{"$error":"#N/A"}},{"$f":"IF(COLUMN()>=INDIRECT(AQ37),IF(COLUMN()<=INDIRECT(AR37),INDIRECT(AS37),\"\"),\"\")","v":{"$error":"#N/A"}},{"$f":"IF(COLUMN()>=INDIRECT(AQ37),IF(COLUMN()<=INDIRECT(AR37),INDIRECT(AS37),\"\"),\"\")","v":{"$error":"#N/A"}},{"$f":"IF(COLUMN()>=INDIRECT(AQ37),IF(COLUMN()<=INDIRECT(AR37),INDIRECT(AS37),\"\"),\"\")","v":{"$error":"#N/A"}},{"$f":"IF(COLUMN()>=INDIRECT(AQ37),IF(COLUMN()<=INDIRECT(AR37),INDIRECT(AS37),\"\"),\"\")","v":{"$error":"#N/A"}},null,{"$f":"CONCATENATE(\"'\",SUBSTITUTE(SUBSTITUTE(SUBSTITUTE(MID(CELL(\"direccion\",'ETAPA III.a'!M$1),FIND(\"]\",CELL(\"direccion\",'ETAPA III.a'!M$1))+1,LEN(CELL(\"direccion\",'ETAPA III.a'!M$1))),\"$\",\"\"),1,MATCH($A34,'ETAPA III.a'!$K:$K,0)),\"!\",\"!$\"))","v":"'ETAPA III.a'!$M176"},{"$f":"CONCATENATE(\"'\",SUBSTITUTE(SUBSTITUTE(SUBSTITUTE(MID(CELL(\"direccion\",'ETAPA III.a'!N$1),FIND(\"]\",CELL(\"direccion\",'ETAPA III.a'!N$1))+1,LEN(CELL(\"direccion\",'ETAPA III.a'!N$1))),\"$\",\"\"),1,MATCH($A34,'ETAPA III.a'!$K:$K,0)),\"!\",\"!$\"))","v":"'ETAPA III.a'!$N176"},{"$f":"CONCATENATE(\"'\",SUBSTITUTE(SUBSTITUTE(SUBSTITUTE(MID(CELL(\"direccion\",'ETAPA III.a'!L$1),FIND(\"]\",CELL(\"direccion\",'ETAPA III.a'!L$1))+1,LEN(CELL(\"direccion\",'ETAPA III.a'!L$1))),\"$\",\"\"),1,MATCH($A34,'ETAPA III.a'!$K:$K,0)),\"!\",\"!$\"))","v":"'ETAPA III.a'!$L176"}]
[25,{"$f":"IF(COLUMN()>=INDIRECT(AQ38),IF(COLUMN()<=INDIRECT(AR38),INDIRECT(AS38),\"\"),\"\")","v":{"$error":"#N/A"}},{"$f":"IF(COLUMN()>=INDIRECT(AQ38),IF(COLUMN()<=INDIRECT(AR38),INDIRECT(AS38),\"\"),\"\")","v":{"$error":"#N/A"}},{"$f":"IF(COLUMN()>=INDIRECT(AQ38),IF(COLUMN()<=INDIRECT(AR38),INDIRECT(AS38),\"\"),\"\")","v":{"$error":"#N/A"}},{"$f":"IF(COLUMN()>=INDIRECT(AQ38),IF(COLUMN()<=INDIRECT(AR38),INDIRECT(AS38),\"\"),\"\")","v":{"$error":"#N/A"}},{"$f":"IF(COLUMN()>=INDIRECT(AQ38),IF(COLUMN()<=INDIRECT(AR38),INDIRECT(AS38),\"\"),\"\")","v":{"$error":"#N/A"}},{"$f":"IF(COLUMN()>=INDIRECT(AQ38),IF(COLUMN()<=INDIRECT(AR38),INDIRECT(AS38),\"\"),\"\")","v":{"$error":"#N/A"}},{"$f":"IF(COLUMN()>=INDIRECT(AQ38),IF(COLUMN()<=INDIRECT(AR38),INDIRECT(AS38),\"\"),\"\")","v":{"$error":"#N/A"}},{"$f":"IF(COLUMN()>=INDIRECT(AQ38),IF(COLUMN()<=INDIRECT(AR38),INDIRECT(AS38),\"\"),\"\")","v":{"$error":"#N/A"}},{"$f":"IF(COLUMN()>=INDIRECT(AQ38),IF(COLUMN()<=INDIRECT(AR38),INDIRECT(AS38),\"\"),\"\")","v":{"$error":"#N/A"}},{"$f":"IF(COLUMN()>=INDIRECT(AQ38),IF(COLUMN()<=INDIRECT(AR38),INDIRECT(AS38),\"\"),\"\")","v":{"$error":"#N/A"}},{"$f":"IF(COLUMN()>=INDIRECT(AQ38),IF(COLUMN()<=INDIRECT(AR38),INDIRECT(AS38),\"\"),\"\")","v":{"$error":"#N/A"}},{"$f":"IF(COLUMN()>=INDIRECT(AQ38),IF(COLUMN()<=INDIRECT(AR38),INDIRECT(AS38),\"\"),\"\")","v":{"$error":"#N/A"}},{"$f":"IF(COLUMN()>=INDIRECT(AQ38),IF(COLUMN()<=INDIRECT(AR38),INDIRECT(AS38),\"\"),\"\")","v":{"$error":"#N/A"}},{"$f":"IF(COLUMN()>=INDIRECT(AQ38),IF(COLUMN()<=INDIRECT(AR38),INDIRECT(AS38),\"\"),\"\")","v":{"$error":"#N/A"}},{"$f":"IF(COLUMN()>=INDIRECT(AQ38),IF(COLUMN()<=INDIRECT(AR38),INDIRECT(AS38),\"\"),\"\")","v":{"$error":"#N/A"}},{"$f":"IF(COLUMN()>=INDIRECT(AQ38),IF(COLUMN()<=INDIRECT(AR38),INDIRECT(AS38),\"\"),\"\")","v":{"$error":"#N/A"}},{"$f":"IF(COLUMN()>=INDIRECT(AQ38),IF(COLUMN()<=INDIRECT(AR38),INDIRECT(AS38),\"\"),\"\")","v":{"$error":"#N/A"}},{"$f":"IF(COLUMN()>=INDIRECT(AQ38),IF(COLUMN()<=INDIRECT(AR38),INDIRECT(AS38),\"\"),\"\")","v":{"$error":"#N/A"}},{"$f":"IF(COLUMN()>=INDIRECT(AQ38),IF(COLUMN()<=INDIRECT(AR38),INDIRECT(AS38),\"\"),\"\")","v":{"$error":"#N/A"}},{"$f":"IF(COLUMN()>=INDIRECT(AQ38),IF(COLUMN()<=INDIRECT(AR38),INDIRECT(AS38),\"\"),\"\")","v":{"$error":"#N/A"}},{"$f":"IF(COLUMN()>=INDIRECT(AQ38),IF(COLUMN()<=INDIRECT(AR38),INDIRECT(AS38),\"\"),\"\")","v":{"$error":"#N/A"}},{"$f":"IF(COLUMN()>=INDIRECT(AQ38),IF(COLUMN()<=INDIRECT(AR38),INDIRECT(AS38),\"\"),\"\")","v":{"$error":"#N/A"}},{"$f":"IF(COLUMN()>=INDIRECT(AQ38),IF(COLUMN()<=INDIRECT(AR38),INDIRECT(AS38),\"\"),\"\")","v":{"$error":"#N/A"}},{"$f":"IF(COLUMN()>=INDIRECT(AQ38),IF(COLUMN()<=INDIRECT(AR38),INDIRECT(AS38),\"\"),\"\")","v":{"$error":"#N/A"}},{"$f":"IF(COLUMN()>=INDIRECT(AQ38),IF(COLUMN()<=INDIRECT(AR38),INDIRECT(AS38),\"\"),\"\")","v":{"$error":"#N/A"}},{"$f":"IF(COLUMN()>=INDIRECT(AQ38),IF(COLUMN()<=INDIRECT(AR38),INDIRECT(AS38),\"\"),\"\")","v":{"$error":"#N/A"}},{"$f":"IF(COLUMN()>=INDIRECT(AQ38),IF(COLUMN()<=INDIRECT(AR38),INDIRECT(AS38),\"\"),\"\")","v":{"$error":"#N/A"}},{"$f":"IF(COLUMN()>=INDIRECT(AQ38),IF(COLUMN()<=INDIRECT(AR38),INDIRECT(AS38),\"\"),\"\")","v":{"$error":"#N/A"}},{"$f":"IF(COLUMN()>=INDIRECT(AQ38),IF(COLUMN()<=INDIRECT(AR38),INDIRECT(AS38),\"\"),\"\")","v":{"$error":"#N/A"}},{"$f":"IF(COLUMN()>=INDIRECT(AQ38),IF(COLUMN()<=INDIRECT(AR38),INDIRECT(AS38),\"\"),\"\")","v":{"$error":"#N/A"}},{"$f":"IF(COLUMN()>=INDIRECT(AQ38),IF(COLUMN()<=INDIRECT(AR38),INDIRECT(AS38),\"\"),\"\")","v":{"$error":"#N/A"}},{"$f":"IF(COLUMN()>=INDIRECT(AQ38),IF(COLUMN()<=INDIRECT(AR38),INDIRECT(AS38),\"\"),\"\")","v":{"$error":"#N/A"}},{"$f":"IF(COLUMN()>=INDIRECT(AQ38),IF(COLUMN()<=INDIRECT(AR38),INDIRECT(AS38),\"\"),\"\")","v":{"$error":"#N/A"}},{"$f":"IF(COLUMN()>=INDIRECT(AQ38),IF(COLUMN()<=INDIRECT(AR38),INDIRECT(AS38),\"\"),\"\")","v":{"$error":"#N/A"}},{"$f":"IF(COLUMN()>=INDIRECT(AQ38),IF(COLUMN()<=INDIRECT(AR38),INDIRECT(AS38),\"\"),\"\")","v":{"$error":"#N/A"}},{"$f":"IF(COLUMN()>=INDIRECT(AQ38),IF(COLUMN()<=INDIRECT(AR38),INDIRECT(AS38),\"\"),\"\")","v":{"$error":"#N/A"}},{"$f":"IF(COLUMN()>=INDIRECT(AQ38),IF(COLUMN()<=INDIRECT(AR38),INDIRECT(AS38),\"\"),\"\")","v":{"$error":"#N/A"}},{"$f":"IF(COLUMN()>=INDIRECT(AQ38),IF(COLUMN()<=INDIRECT(AR38),INDIRECT(AS38),\"\"),\"\")","v":{"$error":"#N/A"}},{"$f":"IF(COLUMN()>=INDIRECT(AQ38),IF(COLUMN()<=INDIRECT(AR38),INDIRECT(AS38),\"\"),\"\")","v":{"$error":"#N/A"}},{"$f":"IF(COLUMN()>=INDIRECT(AQ38),IF(COLUMN()<=INDIRECT(AR38),INDIRECT(AS38),\"\"),\"\")","v":{"$error":"#N/A"}},null,{"$f":"CONCATENATE(\"'\",SUBSTITUTE(SUBSTITUTE(SUBSTITUTE(MID(CELL(\"direccion\",'ETAPA III.a'!M$1),FIND(\"]\",CELL(\"direccion\",'ETAPA III.a'!M$1))+1,LEN(CELL(\"direccion\",'ETAPA III.a'!M$1))),\"$\",\"\"),1,MATCH($A35,'ETAPA III.a'!$K:$K,0)),\"!\",\"!$\"))","v":"'ETAPA III.a'!$M186"},{"$f":"CONCATENATE(\"'\",SUBSTITUTE(SUBSTITUTE(SUBSTITUTE(MID(CELL(\"direccion\",'ETAPA III.a'!N$1),FIND(\"]\",CELL(\"direccion\",'ETAPA III.a'!N$1))+1,LEN(CELL(\"direccion\",'ETAPA III.a'!N$1))),\"$\",\"\"),1,MATCH($A35,'ETAPA III.a'!$K:$K,0)),\"!\",\"!$\"))","v":"'ETAPA III.a'!$N186"},{"$f":"CONCATENATE(\"'\",SUBSTITUTE(SUBSTITUTE(SUBSTITUTE(MID(CELL(\"direccion\",'ETAPA III.a'!L$1),FIND(\"]\",CELL(\"direccion\",'ETAPA III.a'!L$1))+1,LEN(CELL(\"direccion\",'ETAPA III.a'!L$1))),\"$\",\"\"),1,MATCH($A35,'ETAPA III.a'!$K:$K,0)),\"!\",\"!$\"))","v":"'ETAPA III.a'!$L186"}]
[26,{"$f":"IF(COLUMN()>=INDIRECT(AQ36),IF(COLUMN()<=INDIRECT(AR36),INDIRECT(AS36),\"\"),\"\")","v":{"$error":"#N/A"}},{"$f":"IF(COLUMN()>=INDIRECT(AQ36),IF(COLUMN()<=INDIRECT(AR36),INDIRECT(AS36),\"\"),\"\")","v":{"$error":"#N/A"}},{"$f":"IF(COLUMN()>=INDIRECT(AQ36),IF(COLUMN()<=INDIRECT(AR36),INDIRECT(AS36),\"\"),\"\")","v":{"$error":"#N/A"}},{"$f":"IF(COLUMN()>=INDIRECT(AQ36),IF(COLUMN()<=INDIRECT(AR36),INDIRECT(AS36),\"\"),\"\")","v":{"$error":"#N/A"}},{"$f":"IF(COLUMN()>=INDIRECT(AQ36),IF(COLUMN()<=INDIRECT(AR36),INDIRECT(AS36),\"\"),\"\")","v":{"$error":"#N/A"}},{"$f":"IF(COLUMN()>=INDIRECT(AQ36),IF(COLUMN()<=INDIRECT(AR36),INDIRECT(AS36),\"\"),\"\")","v":{"$error":"#N/A"}},{"$f":"IF(COLUMN()>=INDIRECT(AQ36),IF(COLUMN()<=INDIRECT(AR36),INDIRECT(AS36),\"\"),\"\")","v":{"$error":"#N/A"}},{"$f":"IF(COLUMN()>=INDIRECT(AQ36),IF(COLUMN()<=INDIRECT(AR36),INDIRECT(AS36),\"\"),\"\")","v":{"$error":"#N/A"}},{"$f":"IF(COLUMN()>=INDIRECT(AQ36),IF(COLUMN()<=INDIRECT(AR36),INDIRECT(AS36),\"\"),\"\")","v":{"$error":"#N/A"}},{"$f":"IF(COLUMN()>=INDIRECT(AQ36),IF(COLUMN()<=INDIRECT(AR36),INDIRECT(AS36),\"\"),\"\")","v":{"$error":"#N/A"}},{"$f":"IF(COLUMN()>=INDIRECT(AQ36),IF(COLUMN()<=INDIRECT(AR36),INDIRECT(AS36),\"\"),\"\")","v":{"$error":"#N/A"}},{"$f":"IF(COLUMN()>=INDIRECT(AQ36),IF(COLUMN()<=INDIRECT(AR36),INDIRECT(AS36),\"\"),\"\")","v":{"$error":"#N/A"}},{"$f":"IF(COLUMN()>=INDIRECT(AQ36),IF(COLUMN()<=INDIRECT(AR36),INDIRECT(AS36),\"\"),\"\")","v":{"$error":"#N/A"}},{"$f":"IF(COLUMN()>=INDIRECT(AQ36),IF(COLUMN()<=INDIRECT(AR36),INDIRECT(AS36),\"\"),\"\")","v":{"$error":"#N/A"}},{"$f":"IF(COLUMN()>=INDIRECT(AQ36),IF(COLUMN()<=INDIRECT(AR36),INDIRECT(AS36),\"\"),\"\")","v":{"$error":"#N/A"}},{"$f":"IF(COLUMN()>=INDIRECT(AQ36),IF(COLUMN()<=INDIRECT(AR36),INDIRECT(AS36),\"\"),\"\")","v":{"$error":"#N/A"}},{"$f":"IF(COLUMN()>=INDIRECT(AQ36),IF(COLUMN()<=INDIRECT(AR36),INDIRECT(AS36),\"\"),\"\")","v":{"$error":"#N/A"}},{"$f":"IF(COLUMN()>=INDIRECT(AQ36),IF(COLUMN()<=INDIRECT(AR36),INDIRECT(AS36),\"\"),\"\")","v":{"$error":"#N/A"}},{"$f":"IF(COLUMN()>=INDIRECT(AQ36),IF(COLUMN()<=INDIRECT(AR36),INDIRECT(AS36),\"\"),\"\")","v":{"$error":"#N/A"}},{"$f":"IF(COLUMN()>=INDIRECT(AQ36),IF(COLUMN()<=INDIRECT(AR36),INDIRECT(AS36),\"\"),\"\")","v":{"$error":"#N/A"}},{"$f":"IF(COLUMN()>=INDIRECT(AQ36),IF(COLUMN()<=INDIRECT(AR36),INDIRECT(AS36),\"\"),\"\")","v":{"$error":"#N/A"}},{"$f":"IF(COLUMN()>=INDIRECT(AQ36),IF(COLUMN()<=INDIRECT(AR36),INDIRECT(AS36),\"\"),\"\")","v":{"$error":"#N/A"}},{"$f":"IF(COLUMN()>=INDIRECT(AQ36),IF(COLUMN()<=INDIRECT(AR36),INDIRECT(AS36),\"\"),\"\")","v":{"$error":"#N/A"}},{"$f":"IF(COLUMN()>=INDIRECT(AQ36),IF(COLUMN()<=INDIRECT(AR36),INDIRECT(AS36),\"\"),\"\")","v":{"$error":"#N/A"}},{"$f":"IF(COLUMN()>=INDIRECT(AQ36),IF(COLUMN()<=INDIRECT(AR36),INDIRECT(AS36),\"\"),\"\")","v":{"$error":"#N/A"}},{"$f":"IF(COLUMN()>=INDIRECT(AQ36),IF(COLUMN()<=INDIRECT(AR36),INDIRECT(AS36),\"\"),\"\")","v":{"$error":"#N/A"}},{"$f":"IF(COLUMN()>=INDIRECT(AQ36),IF(COLUMN()<=INDIRECT(AR36),INDIRECT(AS36),\"\"),\"\")","v":{"$error":"#N/A"}},{"$f":"IF(COLUMN()>=INDIRECT(AQ36),IF(COLUMN()<=INDIRECT(AR36),INDIRECT(AS36),\"\"),\"\")","v":{"$error":"#N/A"}},{"$f":"IF(COLUMN()>=INDIRECT(AQ36),IF(COLUMN()<=INDIRECT(AR36),INDIRECT(AS36),\"\"),\"\")","v":{"$error":"#N/A"}},{"$f":"IF(COLUMN()>=INDIRECT(AQ36),IF(COLUMN()<=INDIRECT(AR36),INDIRECT(AS36),\"\"),\"\")","v":{"$error":"#N/A"}},{"$f":"IF(COLUMN()>=INDIRECT(AQ36),IF(COLUMN()<=INDIRECT(AR36),INDIRECT(AS36),\"\"),\"\")","v":{"$error":"#N/A"}},{"$f":"IF(COLUMN()>=INDIRECT(AQ36),IF(COLUMN()<=INDIRECT(AR36),INDIRECT(AS36),\"\"),\"\")","v":{"$error":"#N/A"}},{"$f":"IF(COLUMN()>=INDIRECT(AQ36),IF(COLUMN()<=INDIRECT(AR36),INDIRECT(AS36),\"\"),\"\")","v":{"$error":"#N/A"}},{"$f":"IF(COLUMN()>=INDIRECT(AQ36),IF(COLUMN()<=INDIRECT(AR36),INDIRECT(AS36),\"\"),\"\")","v":{"$error":"#N/A"}},{"$f":"IF(COLUMN()>=INDIRECT(AQ36),IF(COLUMN()<=INDIRECT(AR36),INDIRECT(AS36),\"\"),\"\")","v":{"$error":"#N/A"}},{"$f":"IF(COLUMN()>=INDIRECT(AQ36),IF(COLUMN()<=INDIRECT(AR36),INDIRECT(AS36),\"\"),\"\")","v":{"$error":"#N/A"}},{"$f":"IF(COLUMN()>=INDIRECT(AQ36),IF(COLUMN()<=INDIRECT(AR36),INDIRECT(AS36),\"\"),\"\")","v":{"$error":"#N/A"}},{"$f":"IF(COLUMN()>=INDIRECT(AQ36),IF(COLUMN()<=INDIRECT(AR36),INDIRECT(AS36),\"\"),\"\")","v":{"$error":"#N/A"}},{"$f":"IF(COLUMN()>=INDIRECT(AQ36),IF(COLUMN()<=INDIRECT(AR36),INDIRECT(AS36),\"\"),\"\")","v":{"$error":"#N/A"}},{"$f":"IF(COLUMN()>=INDIRECT(AQ36),IF(COLUMN()<=INDIRECT(AR36),INDIRECT(AS36),\"\"),\"\")","v":{"$error":"#N/A"}},null,{"$f":"CONCATENATE(\"'\",SUBSTITUTE(SUBSTITUTE(SUBSTITUTE(MID(CELL(\"direccion\",'ETAPA III.a'!M$1),FIND(\"]\",CELL(\"direccion\",'ETAPA III.a'!M$1))+1,LEN(CELL(\"direccion\",'ETAPA III.a'!M$1))),\"$\",\"\"),1,MATCH($A36,'ETAPA III.a'!$K:$K,0)),\"!\",\"!$\"))","v":"'ETAPA III.a'!$M193"},{"$f":"CONCATENATE(\"'\",SUBSTITUTE(SUBSTITUTE(SUBSTITUTE(MID(CELL(\"direccion\",'ETAPA III.a'!N$1),FIND(\"]\",CELL(\"direccion\",'ETAPA III.a'!N$1))+1,LEN(CELL(\"direccion\",'ETAPA III.a'!N$1))),\"$\",\"\"),1,MATCH($A36,'ETAPA III.a'!$K:$K,0)),\"!\",\"!$\"))","v":"'ETAPA III.a'!$N193"},{"$f":"CONCATENATE(\"'\",SUBSTITUTE(SUBSTITUTE(SUBSTITUTE(MID(CELL(\"direccion\",'ETAPA III.a'!L$1),FIND(\"]\",CELL(\"direccion\",'ETAPA III.a'!L$1))+1,LEN(CELL(\"direccion\",'ETAPA III.a'!L$1))),\"$\",\"\"),1,MATCH($A36,'ETAPA III.a'!$K:$K,0)),\"!\",\"!$\"))","v":"'ETAPA III.a'!$L193"}]
[27,{"$f":"IF(COLUMN()>=INDIRECT(AQ37),IF(COLUMN()<=INDIRECT(AR37),INDIRECT(AS37),\"\"),\"\")","v":{"$error":"#N/A"}},{"$f":"IF(COLUMN()>=INDIRECT(AQ37),IF(COLUMN()<=INDIRECT(AR37),INDIRECT(AS37),\"\"),\"\")","v":{"$error":"#N/A"}},{"$f":"IF(COLUMN()>=INDIRECT(AQ37),IF(COLUMN()<=INDIRECT(AR37),INDIRECT(AS37),\"\"),\"\")","v":{"$error":"#N/A"}},{"$f":"IF(COLUMN()>=INDIRECT(AQ37),IF(COLUMN()<=INDIRECT(AR37),INDIRECT(AS37),\"\"),\"\")","v":{"$error":"#N/A"}},{"$f":"IF(COLUMN()>=INDIRECT(AQ37),IF(COLUMN()<=INDIRECT(AR37),INDIRECT(AS37),\"\"),\"\")","v":{"$error":"#N/A"}},{"$f":"IF(COLUMN()>=INDIRECT(AQ37),IF(COLUMN()<=INDIRECT(AR37),INDIRECT(AS37),\"\"),\"\")","v":{"$error":"#N/A"}},{"$f":"IF(COLUMN()>=INDIRECT(AQ37),IF(COLUMN()<=INDIRECT(AR37),INDIRECT(AS37),\"\"),\"\")","v":{"$error":"#N/A"}},{"$f":"IF(COLUMN()>=INDIRECT(AQ37),IF(COLUMN()<=INDIRECT(AR37),INDIRECT(AS37),\"\"),\"\")","v":{"$error":"#N/A"}},{"$f":"IF(COLUMN()>=INDIRECT(AQ37),IF(COLUMN()<=INDIRECT(AR37),INDIRECT(AS37),\"\"),\"\")","v":{"$error":"#N/A"}},{"$f":"IF(COLUMN()>=INDIRECT(AQ37),IF(COLUMN()<=INDIRECT(AR37),INDIRECT(AS37),\"\"),\"\")","v":{"$error":"#N/A"}},{"$f":"IF(COLUMN()>=INDIRECT(AQ37),IF(COLUMN()<=INDIRECT(AR37),INDIRECT(AS37),\"\"),\"\")","v":{"$error":"#N/A"}},{"$f":"IF(COLUMN()>=INDIRECT(AQ37),IF(COLUMN()<=INDIRECT(AR37),INDIRECT(AS37),\"\"),\"\")","v":{"$error":"#N/A"}},{"$f":"IF(COLUMN()>=INDIRECT(AQ37),IF(COLUMN()<=INDIRECT(AR37),INDIRECT(AS37),\"\"),\"\")","v":{"$error":"#N/A"}},{"$f":"IF(COLUMN()>=INDIRECT(AQ37),IF(COLUMN()<=INDIRECT(AR37),INDIRECT(AS37),\"\"),\"\")","v":{"$error":"#N/A"}},{"$f":"IF(COLUMN()>=INDIRECT(AQ37),IF(COLUMN()<=INDIRECT(AR37),INDIRECT(AS37),\"\"),\"\")","v":{"$error":"#N/A"}},{"$f":"IF(COLUMN()>=INDIRECT(AQ37),IF(COLUMN()<=INDIRECT(AR37),INDIRECT(AS37),\"\"),\"\")","v":{"$error":"#N/A"}},{"$f":"IF(COLUMN()>=INDIRECT(AQ37),IF(COLUMN()<=INDIRECT(AR37),INDIRECT(AS37),\"\"),\"\")","v":{"$error":"#N/A"}},{"$f":"IF(COLUMN()>=INDIRECT(AQ37),IF(COLUMN()<=INDIRECT(AR37),INDIRECT(AS37),\"\"),\"\")","v":{"$error":"#N/A"}},{"$f":"IF(COLUMN()>=INDIRECT(AQ37),IF(COLUMN()<=INDIRECT(AR37),INDIRECT(AS37),\"\"),\"\")","v":{"$error":"#N/A"}},{"$f":"IF(COLUMN()>=INDIRECT(AQ37),IF(COLUMN()<=INDIRECT(AR37),INDIRECT(AS37),\"\"),\"\")","v":{"$error":"#N/A"}},{"$f":"IF(COLUMN()>=INDIRECT(AQ37),IF(COLUMN()<=INDIRECT(AR37),INDIRECT(AS37),\"\"),\"\")","v":{"$error":"#N/A"}},{"$f":"IF(COLUMN()>=INDIRECT(AQ37),IF(COLUMN()<=INDIRECT(AR37),INDIRECT(AS37),\"\"),\"\")","v":{"$error":"#N/A"}},{"$f":"IF(COLUMN()>=INDIRECT(AQ37),IF(COLUMN()<=INDIRECT(AR37),INDIRECT(AS37),\"\"),\"\")","v":{"$error":"#N/A"}},{"$f":"IF(COLUMN()>=INDIRECT(AQ37),IF(COLUMN()<=INDIRECT(AR37),INDIRECT(AS37),\"\"),\"\")","v":{"$error":"#N/A"}},{"$f":"IF(COLUMN()>=INDIRECT(AQ37),IF(COLUMN()<=INDIRECT(AR37),INDIRECT(AS37),\"\"),\"\")","v":{"$error":"#N/A"}},{"$f":"IF(COLUMN()>=INDIRECT(AQ37),IF(COLUMN()<=INDIRECT(AR37),INDIRECT(AS37),\"\"),\"\")","v":{"$error":"#N/A"}},{"$f":"IF(COLUMN()>=INDIRECT(AQ37),IF(COLUMN()<=INDIRECT(AR37),INDIRECT(AS37),\"\"),\"\")","v":{"$error":"#N/A"}},{"$f":"IF(COLUMN()>=INDIRECT(AQ37),IF(COLUMN()<=INDIRECT(AR37),INDIRECT(AS37),\"\"),\"\")","v":{"$error":"#N/A"}},{"$f":"IF(COLUMN()>=INDIRECT(AQ37),IF(COLUMN()<=INDIRECT(AR37),INDIRECT(AS37),\"\"),\"\")","v":{"$error":"#N/A"}},{"$f":"IF(COLUMN()>=INDIRECT(AQ37),IF(COLUMN()<=INDIRECT(AR37),INDIRECT(AS37),\"\"),\"\")","v":{"$error":"#N/A"}},{"$f":"IF(COLUMN()>=INDIRECT(AQ37),IF(COLUMN()<=INDIRECT(AR37),INDIRECT(AS37),\"\"),\"\")","v":{"$error":"#N/A"}},{"$f":"IF(COLUMN()>=INDIRECT(AQ37),IF(COLUMN()<=INDIRECT(AR37),INDIRECT(AS37),\"\"),\"\")","v":{"$error":"#N/A"}},{"$f":"IF(COLUMN()>=INDIRECT(AQ37),IF(COLUMN()<=INDIRECT(AR37),INDIRECT(AS37),\"\"),\"\")","v":{"$error":"#N/A"}},{"$f":"IF(COLUMN()>=INDIRECT(AQ37),IF(COLUMN()<=INDIRECT(AR37),INDIRECT(AS37),\"\"),\"\")","v":{"$error":"#N/A"}},{"$f":"IF(COLUMN()>=INDIRECT(AQ37),IF(COLUMN()<=INDIRECT(AR37),INDIRECT(AS37),\"\"),\"\")","v":{"$error":"#N/A"}},{"$f":"IF(COLUMN()>=INDIRECT(AQ37),IF(COLUMN()<=INDIRECT(AR37),INDIRECT(AS37),\"\"),\"\")","v":{"$error":"#N/A"}},{"$f":"IF(COLUMN()>=INDIRECT(AQ37),IF(COLUMN()<=INDIRECT(AR37),INDIRECT(AS37),\"\"),\"\")","v":{"$error":"#N/A"}},{"$f":"IF(COLUMN()>=INDIRECT(AQ37),IF(COLUMN()<=INDIRECT(AR37),INDIRECT(AS37),\"\"),\"\")","v":{"$error":"#N/A"}},{"$f":"IF(COLUMN()>=INDIRECT(AQ37),IF(COLUMN()<=INDIRECT(AR37),INDIRECT(AS37),\"\"),\"\")","v":{"$error":"#N/A"}},{"$f":"IF(COLUMN()>=INDIRECT(AQ37),IF(COLUMN()<=INDIRECT(AR37),INDIRECT(AS37),\"\"),\"\")","v":{"$error":"#N/A"}},null,{"$f":"CONCATENATE(\"'\",SUBSTITUTE(SUBSTITUTE(SUBSTITUTE(MID(CELL(\"direccion\",'ETAPA III.a'!M$1),FIND(\"]\",CELL(\"direccion\",'ETAPA III.a'!M$1))+1,LEN(CELL(\"direccion\",'ETAPA III.a'!M$1))),\"$\",\"\"),1,MATCH($A37,'ETAPA III.a'!$K:$K,0)),\"!\",\"!$\"))","v":"'ETAPA III.a'!$M200"},{"$f":"CONCATENATE(\"'\",SUBSTITUTE(SUBSTITUTE(SUBSTITUTE(MID(CELL(\"direccion\",'ETAPA III.a'!N$1),FIND(\"]\",CELL(\"direccion\",'ETAPA III.a'!N$1))+1,LEN(CELL(\"direccion\",'ETAPA III.a'!N$1))),\"$\",\"\"),1,MATCH($A37,'ETAPA III.a'!$K:$K,0)),\"!\",\"!$\"))","v":"'ETAPA III.a'!$N200"},{"$f":"CONCATENATE(\"'\",SUBSTITUTE(SUBSTITUTE(SUBSTITUTE(MID(CELL(\"direccion\",'ETAPA III.a'!L$1),FIND(\"]\",CELL(\"direccion\",'ETAPA III.a'!L$1))+1,LEN(CELL(\"direccion\",'ETAPA III.a'!L$1))),\"$\",\"\"),1,MATCH($A37,'ETAPA III.a'!$K:$K,0)),\"!\",\"!$\"))","v":"'ETAPA III.a'!$L200"}]
[28,{"$f":"IF(COLUMN()>=INDIRECT(AQ38),IF(COLUMN()<=INDIRECT(AR38),INDIRECT(AS38),\"\"),\"\")","v":{"$error":"#N/A"}},{"$f":"IF(COLUMN()>=INDIRECT(AQ38),IF(COLUMN()<=INDIRECT(AR38),INDIRECT(AS38),\"\"),\"\")","v":{"$error":"#N/A"}},{"$f":"IF(COLUMN()>=INDIRECT(AQ38),IF(COLUMN()<=INDIRECT(AR38),INDIRECT(AS38),\"\"),\"\")","v":{"$error":"#N/A"}},{"$f":"IF(COLUMN()>=INDIRECT(AQ38),IF(COLUMN()<=INDIRECT(AR38),INDIRECT(AS38),\"\"),\"\")","v":{"$error":"#N/A"}},{"$f":"IF(COLUMN()>=INDIRECT(AQ38),IF(COLUMN()<=INDIRECT(AR38),INDIRECT(AS38),\"\"),\"\")","v":{"$error":"#N/A"}},{"$f":"IF(COLUMN()>=INDIRECT(AQ38),IF(COLUMN()<=INDIRECT(AR38),INDIRECT(AS38),\"\"),\"\")","v":{"$error":"#N/A"}},{"$f":"IF(COLUMN()>=INDIRECT(AQ38),IF(COLUMN()<=INDIRECT(AR38),INDIRECT(AS38),\"\"),\"\")","v":{"$error":"#N/A"}},{"$f":"IF(COLUMN()>=INDIRECT(AQ38),IF(COLUMN()<=INDIRECT(AR38),INDIRECT(AS38),\"\"),\"\")","v":{"$error":"#N/A"}},{"$f":"IF(COLUMN()>=INDIRECT(AQ38),IF(COLUMN()<=INDIRECT(AR38),INDIRECT(AS38),\"\"),\"\")","v":{"$error":"#N/A"}},{"$f":"IF(COLUMN()>=INDIRECT(AQ38),IF(COLUMN()<=INDIRECT(AR38),INDIRECT(AS38),\"\"),\"\")","v":{"$error":"#N/A"}},{"$f":"IF(COLUMN()>=INDIRECT(AQ38),IF(COLUMN()<=INDIRECT(AR38),INDIRECT(AS38),\"\"),\"\")","v":{"$error":"#N/A"}},{"$f":"IF(COLUMN()>=INDIRECT(AQ38),IF(COLUMN()<=INDIRECT(AR38),INDIRECT(AS38),\"\"),\"\")","v":{"$error":"#N/A"}},{"$f":"IF(COLUMN()>=INDIRECT(AQ38),IF(COLUMN()<=INDIRECT(AR38),INDIRECT(AS38),\"\"),\"\")","v":{"$error":"#N/A"}},{"$f":"IF(COLUMN()>=INDIRECT(AQ38),IF(COLUMN()<=INDIRECT(AR38),INDIRECT(AS38),\"\"),\"\")","v":{"$error":"#N/A"}},{"$f":"IF(COLUMN()>=INDIRECT(AQ38),IF(COLUMN()<=INDIRECT(AR38),INDIRECT(AS38),\"\"),\"\")","v":{"$error":"#N/A"}},{"$f":"IF(COLUMN()>=INDIRECT(AQ38),IF(COLUMN()<=INDIRECT(AR38),INDIRECT(AS38),\"\"),\"\")","v":{"$error":"#N/A"}},{"$f":"IF(COLUMN()>=INDIRECT(AQ38),IF(COLUMN()<=INDIRECT(AR38),INDIRECT(AS38),\"\"),\"\")","v":{"$error":"#N/A"}},{"$f":"IF(COLUMN()>=INDIRECT(AQ38),IF(COLUMN()<=INDIRECT(AR38),INDIRECT(AS38),\"\"),\"\")","v":{"$error":"#N/A"}},{"$f":"IF(COLUMN()>=INDIRECT(AQ38),IF(COLUMN()<=INDIRECT(AR38),INDIRECT(AS38),\"\"),\"\")","v":{"$error":"#N/A"}},{"$f":"IF(COLUMN()>=INDIRECT(AQ38),IF(COLUMN()<=INDIRECT(AR38),INDIRECT(AS38),\"\"),\"\")","v":{"$error":"#N/A"}},{"$f":"IF(COLUMN()>=INDIRECT(AQ38),IF(COLUMN()<=INDIRECT(AR38),INDIRECT(AS38),\"\"),\"\")","v":{"$error":"#N/A"}},{"$f":"IF(COLUMN()>=INDIRECT(AQ38),IF(COLUMN()<=INDIRECT(AR38),INDIRECT(AS38),\"\"),\"\")","v":{"$error":"#N/A"}},{"$f":"IF(COLUMN()>=INDIRECT(AQ38),IF(COLUMN()<=INDIRECT(AR38),INDIRECT(AS38),\"\"),\"\")","v":{"$error":"#N/A"}},{"$f":"IF(COLUMN()>=INDIRECT(AQ38),IF(COLUMN()<=INDIRECT(AR38),INDIRECT(AS38),\"\"),\"\")","v":{"$error":"#N/A"}},{"$f":"IF(COLUMN()>=INDIRECT(AQ38),IF(COLUMN()<=INDIRECT(AR38),INDIRECT(AS38),\"\"),\"\")","v":{"$error":"#N/A"}},{"$f":"IF(COLUMN()>=INDIRECT(AQ38),IF(COLUMN()<=INDIRECT(AR38),INDIRECT(AS38),\"\"),\"\")","v":{"$error":"#N/A"}},{"$f":"IF(COLUMN()>=INDIRECT(AQ38),IF(COLUMN()<=INDIRECT(AR38),INDIRECT(AS38),\"\"),\"\")","v":{"$error":"#N/A"}},{"$f":"IF(COLUMN()>=INDIRECT(AQ38),IF(COLUMN()<=INDIRECT(AR38),INDIRECT(AS38),\"\"),\"\")","v":{"$error":"#N/A"}},{"$f":"IF(COLUMN()>=INDIRECT(AQ38),IF(COLUMN()<=INDIRECT(AR38),INDIRECT(AS38),\"\"),\"\")","v":{"$error":"#N/A"}},{"$f":"IF(COLUMN()>=INDIRECT(AQ38),IF(COLUMN()<=INDIRECT(AR38),INDIRECT(AS38),\"\"),\"\")","v":{"$error":"#N/A"}},{"$f":"IF(COLUMN()>=INDIRECT(AQ38),IF(COLUMN()<=INDIRECT(AR38),INDIRECT(AS38),\"\"),\"\")","v":{"$error":"#N/A"}},{"$f":"IF(COLUMN()>=INDIRECT(AQ38),IF(COLUMN()<=INDIRECT(AR38),INDIRECT(AS38),\"\"),\"\")","v":{"$error":"#N/A"}},{"$f":"IF(COLUMN()>=INDIRECT(AQ38),IF(COLUMN()<=INDIRECT(AR38),INDIRECT(AS38),\"\"),\"\")","v":{"$error":"#N/A"}},{"$f":"IF(COLUMN()>=INDIRECT(AQ38),IF(COLUMN()<=INDIRECT(AR38),INDIRECT(AS38),\"\"),\"\")","v":{"$error":"#N/A"}},{"$f":"IF(COLUMN()>=INDIRECT(AQ38),IF(COLUMN()<=INDIRECT(AR38),INDIRECT(AS38),\"\"),\"\")","v":{"$error":"#N/A"}},{"$f":"IF(COLUMN()>=INDIRECT(AQ38),IF(COLUMN()<=INDIRECT(AR38),INDIRECT(AS38),\"\"),\"\")","v":{"$error":"#N/A"}},{"$f":"IF(COLUMN()>=INDIRECT(AQ38),IF(COLUMN()<=INDIRECT(AR38),INDIRECT(AS38),\"\"),\"\")","v":{"$error":"#N/A"}},{"$f":"IF(COLUMN()>=INDIRECT(AQ38),IF(COLUMN()<=INDIRECT(AR38),INDIRECT(AS38),\"\"),\"\")","v":{"$error":"#N/A"}},{"$f":"IF(COLUMN()>=INDIRECT(AQ38),IF(COLUMN()<=INDIRECT(AR38),INDIRECT(AS38),\"\"),\"\")","v":{"$error":"#N/A"}},{"$f":"IF(COLUMN()>=INDIRECT(AQ38),IF(COLUMN()<=INDIRECT(AR38),INDIRECT(AS38),\"\"),\"\")","v":{"$error":"#N/A"}},null,{"$f":"CONCATENATE(\"'\",SUBSTITUTE(SUBSTITUTE(SUBSTITUTE(MID(CELL(\"direccion\",'ETAPA III.a'!M$1),FIND(\"]\",CELL(\"direccion\",'ETAPA III.a'!M$1))+1,LEN(CELL(\"direccion\",'ETAPA III.a'!M$1))),\"$\",\"\"),1,MATCH($A38,'ETAPA III.a'!$K:$K,0)),\"!\",\"!$\"))","v":"'ETAPA III.a'!$M207"},{"$f":"CONCATENATE(\"'\",SUBSTITUTE(SUBSTITUTE(SUBSTITUTE(MID(CELL(\"direccion\",'ETAPA III.a'!N$1),FIND(\"]\",CELL(\"direccion\",'ETAPA III.a'!N$1))+1,LEN(CELL(\"direccion\",'ETAPA III.a'!N$1))),\"$\",\"\"),1,MATCH($A38,'ETAPA III.a'!$K:$K,0)),\"!\",\"!$\"))","v":"'ETAPA III.a'!$N207"},{"$f":"CONCATENATE(\"'\",SUBSTITUTE(SUBSTITUTE(SUBSTITUTE(MID(CELL(\"direccion\",'ETAPA III.a'!L$1),FIND(\"]\",CELL(\"direccion\",'ETAPA III.a'!L$1))+1,LEN(CELL(\"direccion\",'ETAPA III.a'!L$1))),\"$\",\"\"),1,MATCH($A38,'ETAPA III.a'!$K:$K,0)),\"!\",\"!$\"))","v":"'ETAPA III.a'!$L207"}]
[29,{"$f":"IF(COLUMN()>=INDIRECT(AQ39),IF(COLUMN()<=INDIRECT(AR39),INDIRECT(AS39),\"\"),\"\")","v":{"$error":"#N/A"}},{"$f":"IF(COLUMN()>=INDIRECT(AQ39),IF(COLUMN()<=INDIRECT(AR39),INDIRECT(AS39),\"\"),\"\")","v":{"$error":"#N/A"}},{"$f":"IF(COLUMN()>=INDIRECT(AQ39),IF(COLUMN()<=INDIRECT(AR39),INDIRECT(AS39),\"\"),\"\")","v":{"$error":"#N/A"}},{"$f":"IF(COLUMN()>=INDIRECT(AQ39),IF(COLUMN()<=INDIRECT(AR39),INDIRECT(AS39),\"\"),\"\")","v":{"$error":"#N/A"}},{"$f":"IF(COLUMN()>=INDIRECT(AQ39),IF(COLUMN()<=INDIRECT(AR39),INDIRECT(AS39),\"\"),\"\")","v":{"$error":"#N/A"}},{"$f":"IF(COLUMN()>=INDIRECT(AQ39),IF(COLUMN()<=INDIRECT(AR39),INDIRECT(AS39),\"\"),\"\")","v":{"$error":"#N/A"}},{"$f":"IF(COLUMN()>=INDIRECT(AQ39),IF(COLUMN()<=INDIRECT(AR39),INDIRECT(AS39),\"\"),\"\")","v":{"$error":"#N/A"}},{"$f":"IF(COLUMN()>=INDIRECT(AQ39),IF(COLUMN()<=INDIRECT(AR39),INDIRECT(AS39),\"\"),\"\")","v":{"$error":"#N/A"}},{"$f":"IF(COLUMN()>=INDIRECT(AQ39),IF(COLUMN()<=INDIRECT(AR39),INDIRECT(AS39),\"\"),\"\")","v":{"$error":"#N/A"}},{"$f":"IF(COLUMN()>=INDIRECT(AQ39),IF(COLUMN()<=INDIRECT(AR39),INDIRECT(AS39),\"\"),\"\")","v":{"$error":"#N/A"}},{"$f":"IF(COLUMN()>=INDIRECT(AQ39),IF(COLUMN()<=INDIRECT(AR39),INDIRECT(AS39),\"\"),\"\")","v":{"$error":"#N/A"}},{"$f":"IF(COLUMN()>=INDIRECT(AQ39),IF(COLUMN()<=INDIRECT(AR39),INDIRECT(AS39),\"\"),\"\")","v":{"$error":"#N/A"}},{"$f":"IF(COLUMN()>=INDIRECT(AQ39),IF(COLUMN()<=INDIRECT(AR39),INDIRECT(AS39),\"\"),\"\")","v":{"$error":"#N/A"}},{"$f":"IF(COLUMN()>=INDIRECT(AQ39),IF(COLUMN()<=INDIRECT(AR39),INDIRECT(AS39),\"\"),\"\")","v":{"$error":"#N/A"}},{"$f":"IF(COLUMN()>=INDIRECT(AQ39),IF(COLUMN()<=INDIRECT(AR39),INDIRECT(AS39),\"\"),\"\")","v":{"$error":"#N/A"}},{"$f":"IF(COLUMN()>=INDIRECT(AQ39),IF(COLUMN()<=INDIRECT(AR39),INDIRECT(AS39),\"\"),\"\")","v":{"$error":"#N/A"}},{"$f":"IF(COLUMN()>=INDIRECT(AQ39),IF(COLUMN()<=INDIRECT(AR39),INDIRECT(AS39),\"\"),\"\")","v":{"$error":"#N/A"}},{"$f":"IF(COLUMN()>=INDIRECT(AQ39),IF(COLUMN()<=INDIRECT(AR39),INDIRECT(AS39),\"\"),\"\")","v":{"$error":"#N/A"}},{"$f":"IF(COLUMN()>=INDIRECT(AQ39),IF(COLUMN()<=INDIRECT(AR39),INDIRECT(AS39),\"\"),\"\")","v":{"$error":"#N/A"}},{"$f":"IF(COLUMN()>=INDIRECT(AQ39),IF(COLUMN()<=INDIRECT(AR39),INDIRECT(AS39),\"\"),\"\")","v":{"$error":"#N/A"}},{"$f":"IF(COLUMN()>=INDIRECT(AQ39),IF(COLUMN()<=INDIRECT(AR39),INDIRECT(AS39),\"\"),\"\")","v":{"$error":"#N/A"}},{"$f":"IF(COLUMN()>=INDIRECT(AQ39),IF(COLUMN()<=INDIRECT(AR39),INDIRECT(AS39),\"\"),\"\")","v":{"$error":"#N/A"}},{"$f":"IF(COLUMN()>=INDIRECT(AQ39),IF(COLUMN()<=INDIRECT(AR39),INDIRECT(AS39),\"\"),\"\")","v":{"$error":"#N/A"}},{"$f":"IF(COLUMN()>=INDIRECT(AQ39),IF(COLUMN()<=INDIRECT(AR39),INDIRECT(AS39),\"\"),\"\")","v":{"$error":"#N/A"}},{"$f":"IF(COLUMN()>=INDIRECT(AQ39),IF(COLUMN()<=INDIRECT(AR39),INDIRECT(AS39),\"\"),\"\")","v":{"$error":"#N/A"}},{"$f":"IF(COLUMN()>=INDIRECT(AQ39),IF(COLUMN()<=INDIRECT(AR39),INDIRECT(AS39),\"\"),\"\")","v":{"$error":"#N/A"}},{"$f":"IF(COLUMN()>=INDIRECT(AQ39),IF(COLUMN()<=INDIRECT(AR39),INDIRECT(AS39),\"\"),\"\")","v":{"$error":"#N/A"}},{"$f":"IF(COLUMN()>=INDIRECT(AQ39),IF(COLUMN()<=INDIRECT(AR39),INDIRECT(AS39),\"\"),\"\")","v":{"$error":"#N/A"}},{"$f":"IF(COLUMN()>=INDIRECT(AQ39),IF(COLUMN()<=INDIRECT(AR39),INDIRECT(AS39),\"\"),\"\")","v":{"$error":"#N/A"}},{"$f":"IF(COLUMN()>=INDIRECT(AQ39),IF(COLUMN()<=INDIRECT(AR39),INDIRECT(AS39),\"\"),\"\")","v":{"$error":"#N/A"}},{"$f":"IF(COLUMN()>=INDIRECT(AQ39),IF(COLUMN()<=INDIRECT(AR39),INDIRECT(AS39),\"\"),\"\")","v":{"$error":"#N/A"}},{"$f":"IF(COLUMN()>=INDIRECT(AQ39),IF(COLUMN()<=INDIRECT(AR39),INDIRECT(AS39),\"\"),\"\")","v":{"$error":"#N/A"}},{"$f":"IF(COLUMN()>=INDIRECT(AQ39),IF(COLUMN()<=INDIRECT(AR39),INDIRECT(AS39),\"\"),\"\")","v":{"$error":"#N/A"}},{"$f":"IF(COLUMN()>=INDIRECT(AQ39),IF(COLUMN()<=INDIRECT(AR39),INDIRECT(AS39),\"\"),\"\")","v":{"$error":"#N/A"}},{"$f":"IF(COLUMN()>=INDIRECT(AQ39),IF(COLUMN()<=INDIRECT(AR39),INDIRECT(AS39),\"\"),\"\")","v":{"$error":"#N/A"}},{"$f":"IF(COLUMN()>=INDIRECT(AQ39),IF(COLUMN()<=INDIRECT(AR39),INDIRECT(AS39),\"\"),\"\")","v":{"$error":"#N/A"}},{"$f":"IF(COLUMN()>=INDIRECT(AQ39),IF(COLUMN()<=INDIRECT(AR39),INDIRECT(AS39),\"\"),\"\")","v":{"$error":"#N/A"}},{"$f":"IF(COLUMN()>=INDIRECT(AQ39),IF(COLUMN()<=INDIRECT(AR39),INDIRECT(AS39),\"\"),\"\")","v":{"$error":"#N/A"}},{"$f":"IF(COLUMN()>=INDIRECT(AQ39),IF(COLUMN()<=INDIRECT(AR39),INDIRECT(AS39),\"\"),\"\")","v":{"$error":"#N/A"}},{"$f":"IF(COLUMN()>=INDIRECT(AQ39),IF(COLUMN()<=INDIRECT(AR39),INDIRECT(AS39),\"\"),\"\")","v":{"$error":"#N/A"}},null,{"$f":"CONCATENATE(\"'\",SUBSTITUTE(SUBSTITUTE(SUBSTITUTE(MID(CELL(\"direccion\",'ETAPA III.a'!M$1),FIND(\"]\",CELL(\"direccion\",'ETAPA III.a'!M$1))+1,LEN(CELL(\"direccion\",'ETAPA III.a'!M$1))),\"$\",\"\"),1,MATCH($A39,'ETAPA III.a'!$K:$K,0)),\"!\",\"!$\"))","v":"'ETAPA III.a'!$M214"},{"$f":"CONCATENATE(\"'\",SUBSTITUTE(SUBSTITUTE(SUBSTITUTE(MID(CELL(\"direccion\",'ETAPA III.a'!N$1),FIND(\"]\",CELL(\"direccion\",'ETAPA III.a'!N$1))+1,LEN(CELL(\"direccion\",'ETAPA III.a'!N$1))),\"$\",\"\"),1,MATCH($A39,'ETAPA III.a'!$K:$K,0)),\"!\",\"!$\"))","v":"'ETAPA III.a'!$N214"},{"$f":"CONCATENATE(\"'\",SUBSTITUTE(SUBSTITUTE(SUBSTITUTE(MID(CELL(\"direccion\",'ETAPA III.a'!L$1),FIND(\"]\",CELL(\"direccion\",'ETAPA III.a'!L$1))+1,LEN(CELL(\"direccion\",'ETAPA III.a'!L$1))),\"$\",\"\"),1,MATCH($A39,'ETAPA III.a'!$K:$K,0)),\"!\",\"!$\"))","v":"'ETAPA III.a'!$L214"}]
[30,{"$f":"IF(COLUMN()>=INDIRECT(AQ40),IF(COLUMN()<=INDIRECT(AR40),INDIRECT(AS40),\"\"),\"\")","v":{"$error":"#N/A"}},{"$f":"IF(COLUMN()>=INDIRECT(AQ40),IF(COLUMN()<=INDIRECT(AR40),INDIRECT(AS40),\"\"),\"\")","v":{"$error":"#N/A"}},{"$f":"IF(COLUMN()>=INDIRECT(AQ40),IF(COLUMN()<=INDIRECT(AR40),INDIRECT(AS40),\"\"),\"\")","v":{"$error":"#N/A"}},{"$f":"IF(COLUMN()>=INDIRECT(AQ40),IF(COLUMN()<=INDIRECT(AR40),INDIRECT(AS40),\"\"),\"\")","v":{"$error":"#N/A"}},{"$f":"IF(COLUMN()>=INDIRECT(AQ40),IF(COLUMN()<=INDIRECT(AR40),INDIRECT(AS40),\"\"),\"\")","v":{"$error":"#N/A"}},{"$f":"IF(COLUMN()>=INDIRECT(AQ40),IF(COLUMN()<=INDIRECT(AR40),INDIRECT(AS40),\"\"),\"\")","v":{"$error":"#N/A"}},{"$f":"IF(COLUMN()>=INDIRECT(AQ40),IF(COLUMN()<=INDIRECT(AR40),INDIRECT(AS40),\"\"),\"\")","v":{"$error":"#N/A"}},{"$f":"IF(COLUMN()>=INDIRECT(AQ40),IF(COLUMN()<=INDIRECT(AR40),INDIRECT(AS40),\"\"),\"\")","v":{"$error":"#N/A"}},{"$f":"IF(COLUMN()>=INDIRECT(AQ40),IF(COLUMN()<=INDIRECT(AR40),INDIRECT(AS40),\"\"),\"\")","v":{"$error":"#N/A"}},{"$f":"IF(COLUMN()>=INDIRECT(AQ40),IF(COLUMN()<=INDIRECT(AR40),INDIRECT(AS40),\"\"),\"\")","v":{"$error":"#N/A"}},{"$f":"IF(COLUMN()>=INDIRECT(AQ40),IF(COLUMN()<=INDIRECT(AR40),INDIRECT(AS40),\"\"),\"\")","v":{"$error":"#N/A"}},{"$f":"IF(COLUMN()>=INDIRECT(AQ40),IF(COLUMN()<=INDIRECT(AR40),INDIRECT(AS40),\"\"),\"\")","v":{"$error":"#N/A"}},{"$f":"IF(COLUMN()>=INDIRECT(AQ40),IF(COLUMN()<=INDIRECT(AR40),INDIRECT(AS40),\"\"),\"\")","v":{"$error":"#N/A"}},{"$f":"IF(COLUMN()>=INDIRECT(AQ40),IF(COLUMN()<=INDIRECT(AR40),INDIRECT(AS40),\"\"),\"\")","v":{"$error":"#N/A"}},{"$f":"IF(COLUMN()>=INDIRECT(AQ40),IF(COLUMN()<=INDIRECT(AR40),INDIRECT(AS40),\"\"),\"\")","v":{"$error":"#N/A"}},{"$f":"IF(COLUMN()>=INDIRECT(AQ40),IF(COLUMN()<=INDIRECT(AR40),INDIRECT(AS40),\"\"),\"\")","v":{"$error":"#N/A"}},{"$f":"IF(COLUMN()>=INDIRECT(AQ40),IF(COLUMN()<=INDIRECT(AR40),INDIRECT(AS40),\"\"),\"\")","v":{"$error":"#N/A"}},{"$f":"IF(COLUMN()>=INDIRECT(AQ40),IF(COLUMN()<=INDIRECT(AR40),INDIRECT(AS40),\"\"),\"\")","v":{"$error":"#N/A"}},{"$f":"IF(COLUMN()>=INDIRECT(AQ40),IF(COLUMN()<=INDIRECT(AR40),INDIRECT(AS40),\"\"),\"\")","v":{"$error":"#N/A"}},{"$f":"IF(COLUMN()>=INDIRECT(AQ40),IF(COLUMN()<=INDIRECT(AR40),INDIRECT(AS40),\"\"),\"\")","v":{"$error":"#N/A"}},{"$f":"IF(COLUMN()>=INDIRECT(AQ40),IF(COLUMN()<=INDIRECT(AR40),INDIRECT(AS40),\"\"),\"\")","v":{"$error":"#N/A"}},{"$f":"IF(COLUMN()>=INDIRECT(AQ40),IF(COLUMN()<=INDIRECT(AR40),INDIRECT(AS40),\"\"),\"\")","v":{"$error":"#N/A"}},{"$f":"IF(COLUMN()>=INDIRECT(AQ40),IF(COLUMN()<=INDIRECT(AR40),INDIRECT(AS40),\"\"),\"\")","v":{"$error":"#N/A"}},{"$f":"IF(COLUMN()>=INDIRECT(AQ40),IF(COLUMN()<=INDIRECT(AR40),INDIRECT(AS40),\"\"),\"\")","v":{"$error":"#N/A"}},{"$f":"IF(COLUMN()>=INDIRECT(AQ40),IF(COLUMN()<=INDIRECT(AR40),INDIRECT(AS40),\"\"),\"\")","v":{"$error":"#N/A"}},{"$f":"IF(COLUMN()>=INDIRECT(AQ40),IF(COLUMN()<=INDIRECT(AR40),INDIRECT(AS40),\"\"),\"\")","v":{"$error":"#N/A"}},{"$f":"IF(COLUMN()>=INDIRECT(AQ40),IF(COLUMN()<=INDIRECT(AR40),INDIRECT(AS40),\"\"),\"\")","v":{"$error":"#N/A"}},{"$f":"IF(COLUMN()>=INDIRECT(AQ40),IF(COLUMN()<=INDIRECT(AR40),INDIRECT(AS40),\"\"),\"\")","v":{"$error":"#N/A"}},{"$f":"IF(COLUMN()>=INDIRECT(AQ40),IF(COLUMN()<=INDIRECT(AR40),INDIRECT(AS40),\"\"),\"\")","v":{"$error":"#N/A"}},{"$f":"IF(COLUMN()>=INDIRECT(AQ40),IF(COLUMN()<=INDIRECT(AR40),INDIRECT(AS40),\"\"),\"\")","v":{"$error":"#N/A"}},{"$f":"IF(COLUMN()>=INDIRECT(AQ40),IF(COLUMN()<=INDIRECT(AR40),INDIRECT(AS40),\"\"),\"\")","v":{"$error":"#N/A"}},{"$f":"IF(COLUMN()>=INDIRECT(AQ40),IF(COLUMN()<=INDIRECT(AR40),INDIRECT(AS40),\"\"),\"\")","v":{"$error":"#N/A"}},{"$f":"IF(COLUMN()>=INDIRECT(AQ40),IF(COLUMN()<=INDIRECT(AR40),INDIRECT(AS40),\"\"),\"\")","v":{"$error":"#N/A"}},{"$f":"IF(COLUMN()>=INDIRECT(AQ40),IF(COLUMN()<=INDIRECT(AR40),INDIRECT(AS40),\"\"),\"\")","v":{"$error":"#N/A"}},{"$f":"IF(COLUMN()>=INDIRECT(AQ40),IF(COLUMN()<=INDIRECT(AR40),INDIRECT(AS40),\"\"),\"\")","v":{"$error":"#N/A"}},{"$f":"IF(COLUMN()>=INDIRECT(AQ40),IF(COLUMN()<=INDIRECT(AR40),INDIRECT(AS40),\"\"),\"\")","v":{"$error":"#N/A"}},{"$f":"IF(COLUMN()>=INDIRECT(AQ40),IF(COLUMN()<=INDIRECT(AR40),INDIRECT(AS40),\"\"),\"\")","v":{"$error":"#N/A"}},{"$f":"IF(COLUMN()>=INDIRECT(AQ40),IF(COLUMN()<=INDIRECT(AR40),INDIRECT(AS40),\"\"),\"\")","v":{"$error":"#N/A"}},{"$f":"IF(COLUMN()>=INDIRECT(AQ40),IF(COLUMN()<=INDIRECT(AR40),INDIRECT(AS40),\"\"),\"\")","v":{"$error":"#N/A"}},{"$f":"IF(COLUMN()>=INDIRECT(AQ40),IF(COLUMN()<=INDIRECT(AR40),INDIRECT(AS40),\"\"),\"\")","v":{"$error":"#N/A"}},null,{"$f":"CONCATENATE(\"'\",SUBSTITUTE(SUBSTITUTE(SUBSTITUTE(MID(CELL(\"direccion\",'ETAPA III.a'!M$1),FIND(\"]\",CELL(\"direccion\",'ETAPA III.a'!M$1))+1,LEN(CELL(\"direccion\",'ETAPA III.a'!M$1))),\"$\",\"\"),1,MATCH($A40,'ETAPA III.a'!$K:$K,0)),\"!\",\"!$\"))","v":"'ETAPA III.a'!$M221"},{"$f":"CONCATENATE(\"'\",SUBSTITUTE(SUBSTITUTE(SUBSTITUTE(MID(CELL(\"direccion\",'ETAPA III.a'!N$1),FIND(\"]\",CELL(\"direccion\",'ETAPA III.a'!N$1))+1,LEN(CELL(\"direccion\",'ETAPA III.a'!N$1))),\"$\",\"\"),1,MATCH($A40,'ETAPA III.a'!$K:$K,0)),\"!\",\"!$\"))","v":"'ETAPA III.a'!$N221"},{"$f":"CONCATENATE(\"'\",SUBSTITUTE(SUBSTITUTE(SUBSTITUTE(MID(CELL(\"direccion\",'ETAPA III.a'!L$1),FIND(\"]\",CELL(\"direccion\",'ETAPA III.a'!L$1))+1,LEN(CELL(\"direccion\",'ETAPA III.a'!L$1))),\"$\",\"\"),1,MATCH($A40,'ETAPA III.a'!$K:$K,0)),\"!\",\"!$\"))","v":"'ETAPA III.a'!$L221"}]

{"sheet":"ETAPA III.cd","index":11,"n_rows":110,"n_cols":8,"rows_kept":110,"cut":false,"hidden":false,"merged":[[110,0,130,7],[106,0,106,7],[107,0,107,7],[2,3,2,7],[7,0,8,4],[9,0,10,4],[79,3,79,7],[82,0,102,7]]}
[null,null,null,null,null,null,null,{"$f":"TABLAS!$AL$2","v":"BASES PARA LA ELABORACIÓN DE UNA ESTRATEGIA DE REHABILITACIÓN DEL ENTORNO CONSTRUIDO"}]
[null,null,null,null,null,null,null,{"$f":"TABLAS!$AL$6","v":"ETAPA III: PROGRAMA DE ACTUACIONES"}]
[null,null,null,{"$f":"TABLAS!$AL$4","v":""}]
["III.c  Alcance de las acciones"]
[]
["¿Se prevé ampliar el parque de vivienda social o de vivienda en alquiler a precios asequibles?"]
[]
["¿Se prevé integrar nuevas formas de habitación como la vivienda colaborativa, cooperativa, destinada a mayores, jóvenes u otros colectivos?"]
[]
["¿Se prevé favorecer la cohesión y el intercambio generacional (ej: convivencia de jóvenes y mayores), social y cultural en el barrio/ámbito de actuación?"]
[]
["¿Se contribuye a erradicar situaciones de infravivienda?"]
[]
["¿Se prevé recuperar espacios o edificios obsoletos o en desuso para destinarlos a vivienda?"]
[]
["¿Se prevé rehabilitar edificios de forma que se afecte a los espacios comunes de los edificios de uso residencial?"]
[]
["Superficie construida total de los edificios residenciales sobre la que se prevé intervenir (m²)"]
["Objeto de las acciones de rehabilitación:"]
[null,null,"Edificios en uso"]
[]
[null,null,"Edificios en desuso"]
[]
[null,null,"Mejora de la urbanización del espacio público"]
[]
["Tipos de actuaciones de rehabilitación:"]
[null,null,"Rehabilitación estructural"]
[]
[null,null,"Rehabilitación de fachadas, cubiertas o medianeras u otros elementos constructivos"]
[]
[null,null,"Mejora de la Instalación de saneamiento y/o de suministro de agua y/o de electricidad"]
[]
[null,null,"Mejora de la accesibilidad"]
[]
[null,null,"Incorporación o mejora de energías renovables en las instalaciones térmicas"]
[]
[null,null,"Generación de energía eléctrica mediante fuente renovables"]
[]
[null,null,"Infraestructuras asociadas a la movilidad eléctrica"]
[]
[null,null,"Actuaciones de digitalización"]
[]
[null,null,"Retirada del amianto"]
[]
[null,null,"Mejora en la gestión de residuos"]
[]
[null,null,"Otros"]
[]
["¿Las actuaciones previstas implican la demolición de edificaciones existentes? "]
[]
[null,null,"Superficie demolida (m²)",null,"Porcentaje de demolición respecto al total de la actuación"]
[]
["¿Las actuaciones previstas implican la construcción de nuevas edificaciones?"]
[]
[null,null,"Superficie demolida (m²)",null,"Porcentaje de demolición respecto al total de la actuación"]
[]
["Tipos de actuaciones de transformación integral para la adaptación y mitigación del cambio climático del entorno urbano:"]
[null,null,"Renovación y digitalización del alumbrado público"]
[]
[null,null,"Peatonalización y ensanchamiento de calles para el uso peatonal"]
[]
[null,null,"Diseño de micro-espacios de biodiversidad"]
[]
[null,null,"Infraestructuras de movilidad alternativas como carriles para bicicletas, líneas de tranvía, etc."]
[]
[null,null,"Construcción y rehabilitación de parques"]
[]
[null,null,"Implementación de sistemas de drenaje sostenible"]
[]
[null,null,"Instalaciones energéticas de ámbito superior al edificio (district heating,…)."]
[]
[null,null,"Otros"]
[]
["¿Cuál se prevé que sea la calificación energética mayoritaria resultante en los edificios objeto de la rehabilitación sostenible? "]
[]
["¿Se prevé algún realojo temporal de los habitantes de las viviendas afectadas?"]
[]
[null,null,null,null,null,null,null,{"$f":"TABLAS!$AL$2","v":"BASES PARA LA ELABORACIÓN DE UNA ESTRATEGIA DE REHABILITACIÓN DEL ENTORNO CONSTRUIDO"}]
[null,null,null,null,null,null,null,{"$f":"TABLAS!$AL$6","v":"ETAPA III: PROGRAMA DE ACTUACIONES"}]
[null,null,null,{"$f":"TABLAS!$AL$4","v":""}]
["III.d  Observaciones"]
[]
[]
[]
[]
[]
[]
[]
[]
[]
[]
[]
[]
[]
[]
[]
[]
[]
[]
[]
[]
[]
[]
[]
["III.e  Conclusiones extraídas del proceso participativo"]
[]
["¿Se ha alcanzado un elevado grado de consenso con las diferentes administraciones actuantes, así como con los sectores involucrados de la sociedad civil (asociaciones vecinales y ciudadanas, banca, empresas del sector, etc.) para el desarrollo de las actuaciones?"]
[]
[]
["Conclusiones:"]

{"sheet":"ETAPA IV","index":12,"n_rows":157,"n_cols":12,"rows_kept":157,"cut":false,"hidden":false,"merged":[[8,6,8,7],[8,8,8,11],[10,6,10,7],[10,8,10,11],[12,6,12,7],[12,8,12,11],[14,6,14,7],[14,8,14,11],[16,6,16,7],[16,8,16,11],[2,5,2,11],[4,0,5,2],[4,3,5,3],[4,4,5,4],[4,5,5,5],[4,6,5,7],[4,8,5,11],[6,6,6,7],[6,8,6,11],[77,2,77,3],[78,2,78,3],[79,2,79,3],[80,2,80,3],[18,6,18,7],[74,0,76,3],[74,5,74,11],[75,5,75,7],[75,8,75,10],[75,11,76,11],[18,8,18,11],[71,5,71,11],[74,4,76,4],[76,6,76,7],[65,0,68,11],[37,0,40,11],[22,0,23,10],[34,6,35,11],[20,6,20,7],[20,8,20,11],[81,6,81,7],[82,6,82,7],[83,6,83,7],[77,6,77,7],[78,6,78,7],[79,6,79,7],[80,6,80,7],[87,6,87,7],[88,6,88,7],[89,6,89,7],[84,6,84,7],[85,6,85,7],[86,6,86,7],[93,6,93,7],[94,6,94,7],[95,6,95,7],[90,6,90,7],[91,6,91,7],[92,6,92,7],[81,2,81,3],[82,2,82,3],[83,2,83,3],[84,2,84,3],[85,2,85,3],[95,2,95,3],[86,2,86,3],[87,2,87,3],[88,2,88,3],[89,2,89,3],[90,2,90,3],[91,2,91,3],[92,2,92,3],[93,2,93,3],[94,2,94,3],[159,0,178,11],[109,0,122,11],[125,5,125,11],[131,0,132,11],[103,2,103,3],[104,2,104,3],[105,2,105,3],[106,2,106,3],[105,6,105,7],[106,6,106,7],[103,6,103,7],[104,6,104,7],[102,2,102,3],[156,0,158,11],[133,0,152,11],[102,6,102,7],[96,2,96,3],[97,2,97,3],[98,2,98,3],[99,2,99,3],[100,2,100,3],[99,6,99,7],[100,6,100,7],[101,6,101,7],[96,6,96,7],[97,6,97,7],[98,6,98,7],[101,2,101,3]]}
[null,null,null,null,null,null,null,null,null,null,null,{"$f":"TABLAS!$AL$2","v":"BASES PARA LA ELABORACIÓN DE UNA ESTRATEGIA DE REHABILITACIÓN DEL ENTORNO CONSTRUIDO"}]
[null,null,null,null,null,null,null,null,null,null,null,{"$f":"TABLAS!$AL$7","v":"ETAPA IV: IMPLEMENTACIÓN"}]
[null,null,null,null,null,{"$f":"TABLAS!$AL$4","v":""}]
["IV.a   Planeamiento afectado por la estrategia"]
["Instrumento",null,null,"Vigente","Fecha de aprobación","En desarrollo","Fecha prevista de aprobación",null,"Observaciones"]
[]
[null,null,"Plan general  "]
[]
[null,null,"Normas subsidiarias"]
[]
[null,null,"Plan parcial"]
[]
[null,null,"Plan especial"]
[]
[null,null,"Estudio de detalle"]
[]
[null,null,"Plan de Reforma Interior"]
[]
[null,null,"PRI según Art. 72 LOTUP"]
[]
[null,null,"Otros"]
[]
["¿Se han establecido fórmulas o mecanismos para asegurar la aplicación en plazo de las actuaciones previstas, agilizando los trámites administrativos necesarios para el desarrollo de la actuación?"]
[]
["En caso afirmativo, especificar cuáles:"]
[]
[null,null,"Planeamiento",null,null,null,null,"Licencias de intervención"]
[]
[null,null,"Comunicaciones previas",null,null,null,null,"Creación de oficinas municipales de vivienda y regeneración"]
[]
[null,null,"Declaraciones responsables",null,null,null,null,"Res XALOC"]
[]
[null,null,"Licencias de obra",null,null,null,null,"Otros (describir brevemente)"]
[]
[]
[]
["Observaciones:"]
[]
[]
[]
[]
[]
["IV.b   Agentes implicados en la estrategia"]
[]
[null,null,"Aministración General del Estado",null,null,null,null,"Diputación"]
[]
["Generalitat",null,null,null,null,null,"Ayuntamiento"]
[]
[null,null,"Conselleria con competencia en vivienda",null,null,null,null,"Concejalía de Vivienda"]
[]
[null,null,"Conselleria con competencia en urbanismo u obras públicas",null,null,null,null,"Concejalía Urbanismo"]
[]
[null,null,"Otra Conselleria",null,null,null,null,"Concejalía Social"]
[]
[null,null,null,null,null,null,null,"Otras Concejalías"]
[]
["Sociedad civil",null,null,null,null,null,"Sector privado"]
[]
[null,null,"Asociación de vecinos",null,null,null,null,"Comunidades de vecinos"]
[]
[null,null,"Asociación de comerciantes",null,null,null,null,"Empresa(s) Privada(s)"]
[]
[null,null,"Otros",null,null,null,null,"Otros"]
[]
["Observaciones:"]
[]
[]
[]
[]
[null,null,null,null,null,null,null,null,null,null,null,{"$f":"TABLAS!$AL$2","v":"BASES PARA LA ELABORACIÓN DE UNA ESTRATEGIA DE REHABILITACIÓN DEL ENTORNO CONSTRUIDO"}]
[null,null,null,null,null,null,null,null,null,null,null,{"$f":"IF($L$2=\"\",\"\",$L$2)","v":"ETAPA IV: IMPLEMENTACIÓN"}]
[null,null,null,null,null,{"$f":"TABLAS!$AL$4","v":""}]
["IV.c   Acciones, tipos de contrato y tiempos de tramitación"]
[]
["Acción",null,null,null,"Presupuesto","Tiempo orientativo de tramitación (meses)"]
[null,null,null,null,null,"Proyecto",null,null,"Ejecución obra",null,null,"Total"]
[null,null,null,null,null,"Contratación","Redacción",null,"Supervisión","Contatación","Ejecucción"]
["A.1",null,{"$f":"INDIRECT(CONCATENATE(\"'ETAPA III.a'!B\",MATCH(VALUE(SUBSTITUTE(A78,\"A.\",\"\")),'ETAPA III.a'!K:K,0)))","v":0},null,{"$f":"INDIRECT(CONCATENATE(\"'ETAPA III.a'!G\",MATCH(VALUE(SUBSTITUTE(A78,\"A.\",\"\")),'ETAPA III.a'!K:K,0)))","v":0},null,null,null,null,null,null,{"$f":"SUM(F78:K78)","v":0}]
["A.2",null,{"$f":"INDIRECT(CONCATENATE(\"'ETAPA III.a'!B\",MATCH(VALUE(SUBSTITUTE(A79,\"A.\",\"\")),'ETAPA III.a'!K:K,0)))","v":0},null,{"$f":"INDIRECT(CONCATENATE(\"'ETAPA III.a'!G\",MATCH(VALUE(SUBSTITUTE(A79,\"A.\",\"\")),'ETAPA III.a'!K:K,0)))","v":0},null,null,null,null,null,null,{"$f":"SUM(F79:K79)","v":0}]
["A.3",null,{"$f":"INDIRECT(CONCATENATE(\"'ETAPA III.a'!B\",MATCH(VALUE(SUBSTITUTE(A80,\"A.\",\"\")),'ETAPA III.a'!K:K,0)))","v":0},null,{"$f":"INDIRECT(CONCATENATE(\"'ETAPA III.a'!G\",MATCH(VALUE(SUBSTITUTE(A80,\"A.\",\"\")),'ETAPA III.a'!K:K,0)))","v":0},null,null,null,null,null,null,0]
["A.4",null,{"$f":"INDIRECT(CONCATENATE(\"'ETAPA III.a'!B\",MATCH(VALUE(SUBSTITUTE(A81,\"A.\",\"\")),'ETAPA III.a'!K:K,0)))","v":0},null,{"$f":"INDIRECT(CONCATENATE(\"'ETAPA III.a'!G\",MATCH(VALUE(SUBSTITUTE(A81,\"A.\",\"\")),'ETAPA III.a'!K:K,0)))","v":0},null,null,null,null,null,null,0]
["A.5",null,{"$f":"INDIRECT(CONCATENATE(\"'ETAPA III.a'!B\",MATCH(VALUE(SUBSTITUTE(A82,\"A.\",\"\")),'ETAPA III.a'!K:K,0)))","v":0},null,{"$f":"INDIRECT(CONCATENATE(\"'ETAPA III.a'!G\",MATCH(VALUE(SUBSTITUTE(A82,\"A.\",\"\")),'ETAPA III.a'!K:K,0)))","v":0},null,null,null,null,null,null,0]
["A.6",null,{"$f":"INDIRECT(CONCATENATE(\"'ETAPA III.a'!B\",MATCH(VALUE(SUBSTITUTE(A83,\"A.\",\"\")),'ETAPA III.a'!K:K,0)))","v":0},null,{"$f":"INDIRECT(CONCATENATE(\"'ETAPA III.a'!G\",MATCH(VALUE(SUBSTITUTE(A83,\"A.\",\"\")),'ETAPA III.a'!K:K,0)))","v":0},null,null,null,null,null,null,0]
["A.7",null,{"$f":"INDIRECT(CONCATENATE(\"'ETAPA III.a'!B\",MATCH(VALUE(SUBSTITUTE(A84,\"A.\",\"\")),'ETAPA III.a'!K:K,0)))","v":0},null,{"$f":"INDIRECT(CONCATENATE(\"'ETAPA III.a'!G\",MATCH(VALUE(SUBSTITUTE(A84,\"A.\",\"\")),'ETAPA III.a'!K:K,0)))","v":0},null,null,null,null,null,null,0]
["A.8",null,{"$f":"INDIRECT(CONCATENATE(\"'ETAPA III.a'!B\",MATCH(VALUE(SUBSTITUTE(A85,\"A.\",\"\")),'ETAPA III.a'!K:K,0)))","v":0},null,{"$f":"INDIRECT(CONCATENATE(\"'ETAPA III.a'!G\",MATCH(VALUE(SUBSTITUTE(A85,\"A.\",\"\")),'ETAPA III.a'!K:K,0)))","v":0},null,null,null,null,null,null,0]
["A.9",null,{"$f":"INDIRECT(CONCATENATE(\"'ETAPA III.a'!B\",MATCH(VALUE(SUBSTITUTE(A86,\"A.\",\"\")),'ETAPA III.a'!K:K,0)))","v":0},null,{"$f":"INDIRECT(CONCATENATE(\"'ETAPA III.a'!G\",MATCH(VALUE(SUBSTITUTE(A86,\"A.\",\"\")),'ETAPA III.a'!K:K,0)))","v":0},null,null,null,null,null,null,0]
["A.10",null,{"$f":"INDIRECT(CONCATENATE(\"'ETAPA III.a'!B\",MATCH(VALUE(SUBSTITUTE(A87,\"A.\",\"\")),'ETAPA III.a'!K:K,0)))","v":0},null,{"$f":"INDIRECT(CONCATENATE(\"'ETAPA III.a'!G\",MATCH(VALUE(SUBSTITUTE(A87,\"A.\",\"\")),'ETAPA III.a'!K:K,0)))","v":0},null,null,null,null,null,null,0]
["A.11",null,{"$f":"INDIRECT(CONCATENATE(\"'ETAPA III.a'!B\",MATCH(VALUE(SUBSTITUTE(A88,\"A.\",\"\")),'ETAPA III.a'!K:K,0)))","v":0},null,{"$f":"INDIRECT(CONCATENATE(\"'ETAPA III.a'!G\",MATCH(VALUE(SUBSTITUTE(A88,\"A.\",\"\")),'ETAPA III.a'!K:K,0)))","v":0},null,null,null,null,null,null,0]
["A.12",null,{"$f":"INDIRECT(CONCATENATE(\"'ETAPA III.a'!B\",MATCH(VALUE(SUBSTITUTE(A89,\"A.\",\"\")),'ETAPA III.a'!K:K,0)))","v":0},null,{"$f":"INDIRECT(CONCATENATE(\"'ETAPA III.a'!G\",MATCH(VALUE(SUBSTITUTE(A89,\"A.\",\"\")),'ETAPA III.a'!K:K,0)))","v":0},null,null,null,null,null,null,0]
["A.13",null,{"$f":"INDIRECT(CONCATENATE(\"'ETAPA III.a'!B\",MATCH(VALUE(SUBSTITUTE(A90,\"A.\",\"\")),'ETAPA III.a'!K:K,0)))","v":0},null,{"$f":"INDIRECT(CONCATENATE(\"'ETAPA III.a'!G\",MATCH(VALUE(SUBSTITUTE(A90,\"A.\",\"\")),'ETAPA III.a'!K:K,0)))","v":0},null,null,null,null,null,null,0]
["A.14",null,{"$f":"INDIRECT(CONCATENATE(\"'ETAPA III.a'!B\",MATCH(VALUE(SUBSTITUTE(A91,\"A.\",\"\")),'ETAPA III.a'!K:K,0)))","v":0},null,{"$f":"INDIRECT(CONCATENATE(\"'ETAPA III.a'!G\",MATCH(VALUE(SUBSTITUTE(A91,\"A.\",\"\")),'ETAPA III.a'!K:K,0)))","v":0},null,null,null,null,null,null,0]
["A.15",null,{"$f":"INDIRECT(CONCATENATE(\"'ETAPA III.a'!B\",MATCH(VALUE(SUBSTITUTE(A92,\"A.\",\"\")),'ETAPA III.a'!K:K,0)))","v":0},null,{"$f":"INDIRECT(CONCATENATE(\"'ETAPA III.a'!G\",MATCH(VALUE(SUBSTITUTE(A92,\"A.\",\"\")),'ETAPA III.a'!K:K,0)))","v":0},null,null,null,null,null,null,0]
["A.16",null,{"$f":"INDIRECT(CONCATENATE(\"'ETAPA III.a'!B\",MATCH(VALUE(SUBSTITUTE(A93,\"A.\",\"\")),'ETAPA III.a'!K:K,0)))","v":0},null,{"$f":"INDIRECT(CONCATENATE(\"'ETAPA III.a'!G\",MATCH(VALUE(SUBSTITUTE(A93,\"A.\",\"\")),'ETAPA III.a'!K:K,0)))","v":0},null,null,null,null,null,null,0]
["A.17",null,{"$f":"INDIRECT(CONCATENATE(\"'ETAPA III.a'!B\",MATCH(VALUE(SUBSTITUTE(A94,\"A.\",\"\")),'ETAPA III.a'!K:K,0)))","v":0},null,{"$f":"INDIRECT(CONCATENATE(\"'ETAPA III.a'!G\",MATCH(VALUE(SUBSTITUTE(A94,\"A.\",\"\")),'ETAPA III.a'!K:K,0)))","v":0},null,null,null,null,null,null,0]
["A.18",null,{"$f":"INDIRECT(CONCATENATE(\"'ETAPA III.a'!B\",MATCH(VALUE(SUBSTITUTE(A95,\"A.\",\"\")),'ETAPA III.a'!K:K,0)))","v":0},null,{"$f":"INDIRECT(CONCATENATE(\"'ETAPA III.a'!G\",MATCH(VALUE(SUBSTITUTE(A95,\"A.\",\"\")),'ETAPA III.a'!K:K,0)))","v":0},null,null,null,null,null,null,0]
["A.19",null,{"$f":"INDIRECT(CONCATENATE(\"'ETAPA III.a'!B\",MATCH(VALUE(SUBSTITUTE(A96,\"A.\",\"\")),'ETAPA III.a'!K:K,0)))","v":0},null,{"$f":"INDIRECT(CONCATENATE(\"'ETAPA III.a'!G\",MATCH(VALUE(SUBSTITUTE(A96,\"A.\",\"\")),'ETAPA III.a'!K:K,0)))","v":0},null,null,null,null,null,null,0]
["A.20",null,{"$f":"INDIRECT(CONCATENATE(\"'ETAPA III.a'!B\",MATCH(VALUE(SUBSTITUTE(A97,\"A.\",\"\")),'ETAPA III.a'!K:K,0)))","v":0},null,{"$f":"INDIRECT(CONCATENATE(\"'ETAPA III.a'!G\",MATCH(VALUE(SUBSTITUTE(A97,\"A.\",\"\")),'ETAPA III.a'!K:K,0)))","v":0},null,null,null,null,null,null,0]
["A.21",null,{"$f":"INDIRECT(CONCATENATE(\"'ETAPA III.a'!B\",MATCH(VALUE(SUBSTITUTE(A98,\"A.\",\"\")),'ETAPA III.a'!K:K,0)))","v":0},null,{"$f":"INDIRECT(CONCATENATE(\"'ETAPA III.a'!G\",MATCH(VALUE(SUBSTITUTE(A98,\"A.\",\"\")),'ETAPA III.a'!K:K,0)))","v":0},null,null,null,null,null,null,0]
["A.22",null,{"$f":"INDIRECT(CONCATENATE(\"'ETAPA III.a'!B\",MATCH(VALUE(SUBSTITUTE(A99,\"A.\",\"\")),'ETAPA III.a'!K:K,0)))","v":0},null,{"$f":"INDIRECT(CONCATENATE(\"'ETAPA III.a'!G\",MATCH(VALUE(SUBSTITUTE(A99,\"A.\",\"\")),'ETAPA III.a'!K:K,0)))","v":0},null,null,null,null,null,null,0]
["A.23",null,{"$f":"INDIRECT(CONCATENATE(\"'ETAPA III.a'!B\",MATCH(VALUE(SUBSTITUTE(A100,\"A.\",\"\")),'ETAPA III.a'!K:K,0)))","v":0},null,{"$f":"INDIRECT(CONCATENATE(\"'ETAPA III.a'!G\",MATCH(VALUE(SUBSTITUTE(A100,\"A.\",\"\")),'ETAPA III.a'!K:K,0)))","v":0},null,null,null,null,null,null,0]
["A.24",null,{"$f":"INDIRECT(CONCATENATE(\"'ETAPA III.a'!B\",MATCH(VALUE(SUBSTITUTE(A101,\"A.\",\"\")),'ETAPA III.a'!K:K,0)))","v":0},null,{"$f":"INDIRECT(CONCATENATE(\"'ETAPA III.a'!G\",MATCH(VALUE(SUBSTITUTE(A101,\"A.\",\"\")),'ETAPA III.a'!K:K,0)))","v":0},null,null,null,null,null,null,0]
["A.25",null,{"$f":"INDIRECT(CONCATENATE(\"'ETAPA III.a'!B\",MATCH(VALUE(SUBSTITUTE(A102,\"A.\",\"\")),'ETAPA III.a'!K:K,0)))","v":0},null,{"$f":"INDIRECT(CONCATENATE(\"'ETAPA III.a'!G\",MATCH(VALUE(SUBSTITUTE(A102,\"A.\",\"\")),'ETAPA III.a'!K:K,0)))","v":0},null,null,null,null,null,null,0]
["A.26",null,{"$f":"INDIRECT(CONCATENATE(\"'ETAPA III.a'!B\",MATCH(VALUE(SUBSTITUTE(A103,\"A.\",\"\")),'ETAPA III.a'!K:K,0)))","v":0},null,{"$f":"INDIRECT(CONCATENATE(\"'ETAPA III.a'!G\",MATCH(VALUE(SUBSTITUTE(A103,\"A.\",\"\")),'ETAPA III.a'!K:K,0)))","v":0},null,null,null,null,null,null,0]
["A.27",null,{"$f":"INDIRECT(CONCATENATE(\"'ETAPA III.a'!B\",MATCH(VALUE(SUBSTITUTE(A104,\"A.\",\"\")),'ETAPA III.a'!K:K,0)))","v":0},null,{"$f":"INDIRECT(CONCATENATE(\"'ETAPA III.a'!G\",MATCH(VALUE(SUBSTITUTE(A104,\"A.\",\"\")),'ETAPA III.a'!K:K,0)))","v":0},null,null,null,null,null,null,0]
["A.28",null,{"$f":"INDIRECT(CONCATENATE(\"'ETAPA III.a'!B\",MATCH(VALUE(SUBSTITUTE(A105,\"A.\",\"\")),'ETAPA III.a'!K:K,0)))","v":0},null,{"$f":"INDIRECT(CONCATENATE(\"'ETAPA III.a'!G\",MATCH(VALUE(SUBSTITUTE(A105,\"A.\",\"\")),'ETAPA III.a'!K:K,0)))","v":0},null,null,null,null,null,null,0]
["A.29",null,{"$f":"INDIRECT(CONCATENATE(\"'ETAPA III.a'!B\",MATCH(VALUE(SUBSTITUTE(A106,\"A.\",\"\")),'ETAPA III.a'!K:K,0)))","v":0},null,{"$f":"INDIRECT(CONCATENATE(\"'ETAPA III.a'!G\",MATCH(VALUE(SUBSTITUTE(A106,\"A.\",\"\")),'ETAPA III.a'!K:K,0)))","v":0},null,null,null,null,null,null,0]
["A.30",null,{"$f":"INDIRECT(CONCATENATE(\"'ETAPA III.a'!B\",MATCH(VALUE(SUBSTITUTE(A107,\"A.\",\"\")),'ETAPA III.a'!K:K,0)))","v":0},null,{"$f":"INDIRECT(CONCATENATE(\"'ETAPA III.a'!G\",MATCH(VALUE(SUBSTITUTE(A107,\"A.\",\"\")),'ETAPA III.a'!K:K,0)))","v":0},null,null,null,null,null,null,0]
[]
["Observaciones:"]
[]
[]
[]
[]
[]
[]
[]
[]
[]
[]
[]
[]
[]
[]
[null,null,null,null,null,null,null,null,null,null,null,{"$f":"TABLAS!$AL$2","v":"BASES PARA LA ELABORACIÓN DE UNA ESTRATEGIA DE REHABILITACIÓN DEL ENTORNO CONSTRUIDO"}]
[null,null,null,null,null,null,null,null,null,null,null,{"$f":"IF($L$2=\"\",\"\",$L$2)","v":"ETAPA IV: IMPLEMENTACIÓN"}]
[null,null,null,null,null,{"$f":"TABLAS!$AL$4","v":""}]
[]
["IV.d   Seguimiento y control"]
[]
["A. Comité de seguimiento y evaluación:"]
[]
["Especificar el grupo de trabajo que realizará labores de seguimiento y control de una o varias acciones durante la ejecución y a la finalización de las mismas. Estará formado por representantes del ayuntamiento, profesionales que participen en el desarrollo de las acciones y representares de la ciudadanía vinculados a las acciones previstas."]
[]
[]
[]
[]
[]
[]
[]
[]
[]
[]
[]
[]
[]
[]
[]
[]
[]
[]
[]
[]
[]
[]
["B. Indicadores durante la ejecución y la finalización de cada acción o grupo de acciones:"]
[]
["Estos indicadores permitirán analizar la evolución de la ejecución de la acción mediante la evaluación continua del grado de cumplimiento de los plazos, las previsiones económicas, las condiciones técnicas de calidad, eficiencia energética, accesibilidad o de género.\nLa definición de indicadores dependerá de la naturaleza de cada acción, de forma que, analizados con determinada periodicidad, permitan la detección de posibles desviaciones y por tanto faciliten la toma de decisiones para lograr el resultado esperado."]

{"sheet":"ANEJO 1","index":13,"n_rows":261,"n_cols":25,"rows_kept":261,"cut":false,"hidden":false,"merged":[[258,8,258,24],[260,8,260,24],[246,8,246,24],[248,3,248,4],[248,8,248,24],[250,8,250,24],[254,8,254,24],[256,8,256,24],[232,5,232,24],[233,5,233,24],[235,0,235,24],[237,19,237,24],[242,3,242,5],[242,8,242,24],[218,0,218,24],[220,19,220,24],[224,5,224,24],[227,5,227,24],[229,5,229,24],[230,5,230,24],[198,1,206,4],[198,11,206,14],[198,16,206,19],[208,1,216,4],[208,11,216,14],[208,16,216,19],[226,5,226,24],[223,5,223,24],[178,1,186,4],[178,11,186,14],[178,16,186,19],[188,1,196,4],[188,11,196,14],[188,16,196,19],[171,0,171,24],[173,19,173,24],[176,1,176,4],[176,6,176,9],[176,11,176,14],[176,16,176,19],[176,21,176,24],[145,11,145,14],[145,16,145,24],[147,3,148,9],[148,12,169,14],[164,18,169,24],[169,3,169,9],[136,3,138,4],[136,6,138,14],[136,19,138,19],[138,23,138,24],[140,0,140,24],[142,19,142,24],[120,3,122,4],[120,6,122,14],[124,3,126,4],[124,6,126,14],[128,6,130,14],[132,6,134,14],[99,9,100,24],[102,9,103,24],[105,9,111,24],[117,0,117,14],[117,16,118,19],[117,21,118,24],[118,0,118,4],[118,6,118,14],[83,1,90,9],[86,18,90,24],[90,13,90,14],[92,0,92,24],[94,19,94,24],[97,0,97,8],[97,9,97,24],[62,5,63,24],[65,5,66,24],[68,5,69,24],[71,5,72,24],[81,1,81,9],[81,19,81,24],[46,1,46,24],[48,19,48,24],[51,5,51,24],[53,5,54,24],[56,5,57,24],[59,5,60,24],[29,11,32,14],[34,11,37,14],[35,18,36,19],[35,23,38,24],[38,18,39,19],[42,18,44,19],[19,8,21,9],[19,11,22,14],[19,23,20,24],[22,24,23,24],[24,8,26,9],[24,11,27,14],[25,23,26,24],[0,0,0,24],[2,10,2,14],[2,19,2,24],[16,1,17,4],[16,6,16,14],[16,16,17,19],[16,21,17,24],[17,6,17,9],[17,11,17,14]]}
[{"$f":"TABLAS!$AL$2","v":"BASES PARA LA ELABORACIÓN DE UNA ESTRATEGIA DE REHABILITACIÓN DEL ENTORNO CONSTRUIDO"}]
[null,null,null,null,null,null,null,null,null,null,null,null,null,null,null,null,null,null,null,null,null,null,null,null,{"$f":"TABLAS!$AL$8","v":"ANEJO 1: PARTICIPACIÓN Y GOBERNANZA"}]
[null,null,null,null,null,null,null,null,null,null,null,null,null,null,null,null,null,null,null,{"$f":"TABLAS!$AL$4","v":""}]
["A. Participación durante la redacción de la estrategia"]
[]
[null,null,null,"No se ha realizado participación ciudadana para la planificación estratégica (en este caso no es necesario rellenar este anejo)"]
[]
[null,null,null,"Sí se ha realizado participación ciudadana para la planificación estratégica"]
[]
[null,null,null,null,null,null,null,null,"Participación específica para la redacción de la \"Estrategia municipal de rehabilitación y regeneración del hábitat construido\""]
[]
[null,null,null,null,null,null,null,null,"Participación para otras estrategias. Si su municipio ya realizó participación ciudadana para la definición de una estrategia municipal previa "]
[null,null,null,null,null,null,null,null,"(EDUSI, ARRU, PUAM o similar), rellene este bloque en función de la participación implementada"]
[]
["A1. Participación ciudadana y de agentes sociales durante la redacción de la estrategia"]
[]
[null," Nivel de participación alcanzado\n(ver leyenda 1)",null,null,null,null,"Agentes que han participado",null,null,null,null,null,null,null,null,null,"Técnicas y herramientas de participación utilizadas para la redacción de la estrategia",null,null,null,null,"Espacios y órganos de participación utilizados (permanentes a lo largo del proceso) (ver leyenda 2)"]
[null,null,null,null,null,null,"Grupo",null,null,null,null,"Nombre del colectivo o entidad (si han participado personas a título personal, solo indicar nº aproximado, no datos personales)"]
[]
[null,null,null,"1. Informar",null,null,null,null,"Agentes ciudadanos (individualmente o a través de colectivos y entidades, Tercer Sector, etc.)",null,null,null,null,null,null,null,null,null," Encuestas y consultas ciudadanas",null,null,null,null,"A. Grupos existentes, no generados específicamente para la estrategia"]
[]
[null,null,null,"2. Consultar",null,null,null,null,null,null,null,null,null,null,null,null,null,null,"Exposiciones interactivas"]
[null,null,null,null,null,null,null,null,null,null,null,null,null,null,null,null,null,null,null,null,null,null,null,null," A1. Consejos municipales o\n ciudadanos"]
[null,null,null,"3. Implicar",null,null,null,null,null,null,null,null,null,null,null,null,null,null,"Jornadas (presenciales y online)"]
[null,null,null,null,null,null,null,null,"Equipamientos públicos (biblioteca; centro de salud; centros escolares y formativos, culturales, deportivos, etc.)"]
[null,null,null,"4. Colaborar",null,null,null,null,null,null,null,null,null,null,null,null,null,null,"Debates, coloquios, foros",null,null,null,null,"B. Grupos  generados específicamente para la estrategia"]
[]
[null,null,null,null,null,null,null,null,null,null,null,null,null,null,null,null,null,null,"Talleres"]
[null,null,null,null,null,null,null,null,null,null,null,null,null,null,null,null,null,null,null,null,null,null,null,null," B1. Grupo motor"]
[null,null,null,null,null,null,null,null,"Sector privado",null,null,null,null,null,null,null,null,null,"Entrevistas (individuales o grupales)"]
[null,null,null,null,null,null,null,null,null,null,null,null,null,null,null,null,null,null,null,null,null,null,null,null," B2. Grupos o comisiones de trabajo"]
[null,null,null,null,null,null,null,null,null,null,null,null,null,null,null,null,null,null,"Asambleas ciudadanas"]
[null,null,null,null,null,null,null,null,null,null,null,null,null,null,null,null,null,null,null,null,null,null,null,null,"B3. Comisión de seguimiento"]
[null,null,null,null,null,null,null,null,null,null,null,null,null,null,null,null,null,null,"Dinámicas de grupo"]
[null,null,null,null,null,null,null,null,"Sector investigador o académico",null,null,null,null,null,null,null,null,null,null,null,null,null,null,"Otros. Especifique cuáles:"]
[null,null,null,null,null,null,null,null,null,null,null,null,null,null,null,null,null,null,"Urbanismo táctico, acciones en el espacio público"]
[]
[]
[null,null,null,null,null,null,null,null,null,null,null,null,null,null,null,null,null,null,"Mapeos colectivos, derivas, paseos de \"Jane\""]
[]
[]
[null,null,null,null,null,null,null,null,null,null,null,null,null,null,null,null,null,null,"Otras. Especifique cuáles:"]
[]
[]
[]
[]
[null,{"$f":"TABLAS!$AL$2","v":"BASES PARA LA ELABORACIÓN DE UNA ESTRATEGIA DE REHABILITACIÓN DEL ENTORNO CONSTRUIDO"}]
[null,null,null,null,null,null,null,null,null,null,null,null,null,null,null,null,null,null,null,null,null,null,null,null,{"$f":"IF($Y$2=\"\",\"\",$Y$2)","v":"ANEJO 1: PARTICIPACIÓN Y GOBERNANZA"}]
[null,null,null,null,null,null,null,null,null,null,null,null,null,null,null,null,null,null,null,{"$f":"TABLAS!$AL$4","v":""}]
[null,null,null,null,"Participación específica para la plena inclusión (enfoque de género, implicación de colectivos vulnerabilizados, etc.)"]
[]
[null,null,null,null,"Grupo","Técnicas, herramientas y espacios que se han utilizado para la inclusión de cada grupo"]
[]
[null,null,null,null,"Infancia"]
[]
[]
[null,null,null,null,"Juventud"]
[]
[]
[null,null,null,null,"Personas mayores"]
[]
[]
[null,null,null,null,"Diversidad funcional"]
[]
[]
[null,null,null,null,"Migrantes / Diversidad cultural"]
[]
[]
[null,null,null,null,"Mujeres"]
[]
[]
[null,null,null,null,"Otros"]
[]
[]
[]
["A2. Participación interna en el Ayuntamiento durante la redacción de la estrategia"]
[]
[null,null,null,null,"No se ha realizado participación interna en el Ayuntamiento (en este caso no es necesario rellenar el apartado A2)"]
[]
[null,null,null,null,"Sí se ha realizado participación interna en el Ayuntamiento"]
[]
[null,"Servicios y concejalías que han participado (personal técnico y político)",null,null,null,null,null,null,null,null,null,null,null,null,"Técnicas y herramientas de participación",null,null,null,null,"¿Se han establecido espacios de interacción  entre los técnicos y la ciudadanía y resto de agentes?"]
[]
[null,null,null,null,null,null,null,null,null,null,null,null,null,"Encuesta",null,null,null,null,"No"]
[]
[null,null,null,null,null,null,null,null,null,null,null,null,null,"Reuniones específicas",null,null,null,null,"Sí. Especifique cuáles:"]
[]
[null,null,null,null,null,null,null,null,null,null,null,null,null,"Grupos o comisiones de trabajo"]
[]
[null,null,null,null,null,null,null,null,null,null,null,null,null,"Otras. Especifique cuáles:"]
[]
[]
[{"$f":"TABLAS!$AL$2","v":"BASES PARA LA ELABORACIÓN DE UNA ESTRATEGIA DE REHABILITACIÓN DEL ENTORNO CONSTRUIDO"}]
[null,null,null,null,null,null,null,null,null,null,null,null,null,null,null,null,null,null,null,null,null,null,null,null,{"$f":"IF($Y$2=\"\",\"\",$Y$2)","v":"ANEJO 1: PARTICIPACIÓN Y GOBERNANZA"}]
[null,null,null,null,null,null,null,null,null,null,null,null,null,null,null,null,null,null,null,{"$f":"TABLAS!$AL$4","v":""}]
["A3. Aportaciones de la participación ciudadana por etapas"]
[]
["¿En qué etapas de la estrategia se ha contado con participación ciudadana?",null,null,null,null,null,null,null,null,"Conclusiones extraídas de la participación en cada etapa"]
[]
[null,{"$f":"IF(J100=\"\",\"\",\"X\")","v":""},null,null,"Etapa I. Identificación del ámbito",null,null,null,null,{"$f":"IF('ETAPA I'!A85=\"\",\"\",'ETAPA I'!A85)","v":""}]
[]
[]
[null,{"$f":"IF(J103=\"\",\"\",\"X\")","v":""},null,null,"Etapa II. Análisis y diagnóstico",null,null,null,null,{"$f":"IF('ETAPA II.i'!A10=\"\",\"\",'ETAPA II.i'!A10)","v":""}]
[]
[]
[null,{"$f":"IF(J106=\"\",\"\",\"X\")","v":""},null,null,"Etapa III. Programa de actuaciones",null,null,null,null,{"$f":"IF('ETAPA III.cd'!A111=\"\",\"\",'ETAPA III.cd'!A111)","v":""}]
[]
[null,null,null,null," Objetivos estratégicos"]
[]
[null,null,null,null," Objetivos específicos"]
[]
[null,null,null,null," Líneas de actuación"]
[]
[null,"B. Participación durante la implementación de la estrategia"]
[]
["B1. Gobernanza, seguimiento y evaluación de la estrategia"]
[]
["Agentes que se implicarán durante la gobernanza, seguimiento y evaluación de la estrategia",null,null,null,null,null,null,null,null,null,null,null,null,null,null,null,"Espacios u órganos de gobernanza colaborativa (gestión, seguimiento y evaluación) (ver leyenda 2)",null,null,null,null,"¿Qué técnicas y herramientas se utilizarán específicamente para la evaluación?"]
["Grupo",null,null,null,null,null,"Nombre del colectivo o entidad.  Si han participado personas a título personal, solamente indicar número aproximado, no datos personales"]
[]
[null,null,null,"Agentes ciudadanos (individualmente o a través de colectivos, entidades, Tercer Sector...)",null,null,null,null,null,null,null,null,null,null,null,null,null,null,"A. Grupos existentes, no generados",null,null,null,null,"No se realiza evaluación"]
[null,null,null,null,null,null,null,null,null,null,null,null,null,null,null,null,null,null," específicamente para la estrategia"]
[null,null,null,null,null,null,null,null,null,null,null,null,null,null,null,null,null,null,null,null,null,null,null,"Encuestas"]
[null,null,null,null,null,null,null,null,null,null,null,null,null,null,null,null,null,null,null,"A1. Consejos municipales o "]
[null,null,null,"Administración pública: servicios y equipamientos públicos",null,null,null,null,null,null,null,null,null,null,null,null,null,null,null,"ciudadanos",null,null,null,"Rúbricas"]
[]
[null,null,null,null,null,null,null,null,null,null,null,null,null,null,null,null,null,null,"B. Grupos generados ",null,null,null,null,"Taller. Jornadas"]
[null,null,null,null,null,null,null,null,null,null,null,null,null,null,null,null,null,null,"específicamente para la estrategia"]
[null,null,null,"Sector privado",null,null,null,null,null,null,null,null,null,null,null,null,null,null,null,null,null,null,null,"Análisis de datos"]
[null,null,null,null,null,null,null,null,null,null,null,null,null,null,null,null,null,null,null," B1. Grupo motor"]
[null,null,null,null,null,null,null,null,null,null,null,null,null,null,null,null,null,null,null,null,null,null,null,"Grupos de discusión específicos"]
[null,null,null,null,null,null,null,null,null,null,null,null,null,null,null,null,null,null,null," B2. Grupos o comisiones de trabajo"]
[null,null,null,"Sector investigador o académico",null,null,null,null,null,null,null,null,null,null,null,null,null,null,null,null,null,null,null,"Observación paticipante y no"]
[null,null,null,null,null,null,null,null,null,null,null,null,null,null,null,null,null,null,null," B3. Comisión de seguimiento ",null,null,null,"participante"]
[]
[null,null,null,null,null,null,null,null,null,null,null,null,null,null,null,null,null,null,"Otros. Indique cuáles:",null,null,null,null,"Escucha activa redes sociales"]
[null,null,null,"Ninguno. La implementación la realizará el Ayuntamiento. "]
[null,null,null,null,null,null,null,null,null,null,null,null,null,null,null,null,null,null,null,null,null,null,null,"Otros. Indique cuáles:"]
[]
[]
[{"$f":"TABLAS!$AL$2","v":"BASES PARA LA ELABORACIÓN DE UNA ESTRATEGIA DE REHABILITACIÓN DEL ENTORNO CONSTRUIDO"}]
[null,null,null,null,null,null,null,null,null,null,null,null,null,null,null,null,null,null,null,null,null,null,null,null,{"$f":"IF($Y$2=\"\",\"\",$Y$2)","v":"ANEJO 1: PARTICIPACIÓN Y GOBERNANZA"}]
[null,null,null,null,null,null,null,null,null,null,null,null,null,null,null,null,null,null,null,{"$f":"TABLAS!$AL$4","v":""}]
[null,"B2. Comunicación y difusión de la estrategia"]
[]
[null,"Estrategia de comunicación durante la implementación de la estrategia",null,null,null,null,null,null,null,null,null,"¿Se han desarrollado actividades de concienciación o formación específicas vinculadas a la estrategia?",null,null,null,null,"¿Cómo se asegura la transparencia? Indique mecanismos y/o herramientas"]
[]
[null,null,null,"Espacios de información, comunicación y difusión creados específicamente para la estrategia",null,null,null,null,null,null,null,null,null,"Si es el caso, indique cuáles:",null,null,"Si es el caso, indique cuáles:"]
[]
[null,null,null,null,null,null,null,null,null,null,null,null,null,null,null,null,null,null,"Publicación de resultados de la participación y del contenido de la estrategia"]
[null,null,null,null," Mail o teléfono propio del proyecto. ",null,null,null,null,null,null,null,null,null,null,null,null,null," (resultados intermedios y finales, actas actividades y órganos de participación, "]
[null,null,null,null,null,null,null,null,null,null,null,null,null,null,null,null,null,null,"información sobre el estado de implementación de cada línea estratégica y acción, etc.)"]
[null,null,null,null," Web, redes sociales u otros medios telemáticos propios del proyecto"]
[null,null,null,null,null,null,null,null,null,null,null,null,null,null,null,null,null,null,"Transparencia económico - financiera"]
[null,null,null,null," Espacio físico de información y difusión de la estrategia (oficina, stand, etc.)",null,null,null,null,null,null,null,null,null,null,null,null,null,"(presupuesto destinado a la estrategia y a cada una de sus acciones)"]
[]
[null,null,null,null," Difusión en papel: Cartelería, flyers, buzoneo, otros",null,null,null,null,null,null,null,null,null,null,null,null,null,"Transparencia en las contrataciones, convenios y licitación de obras"]
[null,null,null,null,null,null,null,null,null,null,null,null,null,null,null,null,null,null,"(publicación de los procesos, baremos, contratos, etc.)"]
[null,null,null,null," Merchandising"]
[null,null,null,null,null,null,null,null,null,null,null,null,null,null,null,null,null,null,"Asegurar el acceso a la información"]
[null,null,null,"Difusión en medios municipales (redes sociales, bandos, web municipal, folletos, etc.)",null,null,null,null,null,null,null,null,null,null,null,null,null,null,"(se especifican canales y características del acceso a la información; "]
[null,null,null,null,null,null,null,null,null,null,null,null,null,null,null,null,null,null,"reclamaciones y solicitudes, etc.)"]
[null,null,null,"Difusión en medios de comunicación ajenos (prensa, otras redes sociales, etc.)"]
[null,null,null,null,null,null,null,null,null,null,null,null,null,null,null,null,null,null,"Otros. Especifique cuáles"]
[null,null,null,"Estrategias de escucha activa a la población (en redes sociales, teléfonos de atención"]
[null,null,null,"al ciudadano, derivación desde otros servicios de consulta ciudadana de las "]
[null,null,null,"aportaciones vinculadas a la estrategia, etc.)"]
[]
[null,null,null,"Otros. Especifique cuáles:"]
[]
[]
[{"$f":"TABLAS!$AL$2","v":"BASES PARA LA ELABORACIÓN DE UNA ESTRATEGIA DE REHABILITACIÓN DEL ENTORNO CONSTRUIDO"}]
[null,null,null,null,null,null,null,null,null,null,null,null,null,null,null,null,null,null,null,null,null,null,null,null,{"$f":"IF($Y$2=\"\",\"\",$Y$2)","v":"ANEJO 1: PARTICIPACIÓN Y GOBERNANZA"}]
[null,null,null,null,null,null,null,null,null,null,null,null,null,null,null,null,null,null,null,{"$f":"TABLAS!$AL$4","v":""}]
[null,null,null,"C. Participación en el desarrollo pormenorizado e implementación de cada una de las acciones"]
[]
[null,"Código y nombre de la acción",null,null,null,null,"Nivel de participación que se desea alcanzar durante el diseño pormenorizado de cada acción (ver leyenda 1)",null,null,null,null,"Agentes que participarán en el diseño de cada acción",null,null,null,null,"Técnicas y herramientas de participación previstos",null,null,null,null,"Enfoque de gestión del espacio resultante tras la ejecución (si procede) (posterior a la etapa IV) (ver leyenda 2)"]
[]
[null,null,null,null,null,null,null,null,null," No definida",null,null,null,null,null,null,null,null,null,null,null,null,null,"A. Gestión no participada"]
[]
[null,null,null,null,null,null,null,null,null," 1. Informar",null,null,null,null,null,null,null,null,null,null,null,null,null,"B. Gestión participada"]
[]
[null,null,null,null,null,null,null,null,null," 2. Consultar",null,null,null,null,null,null,null,null,null,null,null,null,null,null," B1. Colaboración público-privada"]
[]
[null,null,null,null,null,null,null,null,null," 3. Implicar",null,null,null,null,null,null,null,null,null,null,null,null,null,null," B2. Gestión cívica o ciudadana"]
[]
[null,null,null,null,null,null,null,null,null," 4. Colaborar"]
[]
[null,null,null,null,null,null,null,null,null," No definida",null,null,null,null,null,null,null,null,null,null,null,null,null,"A. Gestión no participada"]
[]
[null,null,null,null,null,null,null,null,null," 1. Informar",null,null,null,null,null,null,null,null,null,null,null,null,null,"B. Gestión participada"]
[]
[null,null,null,null,null,null,null,null,null," 2. Consultar",null,null,null,null,null,null,null,null,null,null,null,null,null,null," B1. Colaboración público-privada"]
[]
[null,null,null,null,null,null,null,null,null," 3. Implicar",null,null,null,null,null,null,null,null,null,null,null,null,null,null," B2. Gestión cívica o ciudadana"]
[]
[null,null,null,null,null,null,null,null,null," 4. Colaborar"]
[]
[null,null,null,null,null,null,null,null,null," No definida",null,null,null,null,null,null,null,null,null,null,null,null,null,"A. Gestión no participada"]
[]
[null,null,null,null,null,null,null,null,null," 1. Informar",null,null,null,null,null,null,null,null,null,null,null,null,null,"B. Gestión participada"]
[]
[null,null,null,null,null,null,null,null,null," 2. Consultar",null,null,null,null,null,null,null,null,null,null,null,null,null,null," B1. Colaboración público-privada"]
[]
[null,null,null,null,null,null,null,null,null," 3. Implicar",null,null,null,null,null,null,null,null,null,null,null,null,null,null," B2. Gestión cívica o ciudadana"]
[]
[null,null,null,null,null,null,null,null,null," 4. Colaborar"]
[]
[null,null,null,null,null,null,null,null,null," No definida",null,null,null,null,null,null,null,null,null,null,null,null,null,"A. Gestión no participada"]
[]
[null,null,null,null,null,null,null,null,null," 1. Informar",null,null,null,null,null,null,null,null,null,null,null,null,null,"B. Gestión participada"]
[]
[null,null,null,null,null,null,null,null,null," 2. Consultar",null,null,null,null,null,null,null,null,null,null,null,null,null,null," B1. Colaboración público-privada"]
[]
[null,null,null,null,null,null,null,null,null," 3. Implicar",null,null,null,null,null,null,null,null,null,null,null,null,null,null," B2. Gestión cívica o ciudadana"]
[]
[null,null,null,null,null,null,null,null,null," 4. Colaborar"]
[]
[{"$f":"TABLAS!$AL$2","v":"BASES PARA LA ELABORACIÓN DE UNA ESTRATEGIA DE REHABILITACIÓN DEL ENTORNO CONSTRUIDO"}]
[null,null,null,null,null,null,null,null,null,null,null,null,null,null,null,null,null,null,null,null,null,null,null,null,{"$f":"IF($Y$2=\"\",\"\",$Y$2)","v":"ANEJO 1: PARTICIPACIÓN Y GOBERNANZA"}]
[null,null,null,null,null,null,null,null,null,null,null,null,null,null,null,null,null,null,null,{"$f":"TABLAS!$AL$4","v":""}]
[null,"Leyenda 1 - Niveles de participación"]
[]
[null,"1. Informar",null,null,null,"Objetivo de participación ciudadana: Brindar información equilibrada y objetiva para ayudarlo a comprender el problema, las alternativas, las oportunidades y / o las soluciones."]
[null,null,null,null,null,"Compromiso con la ciudadanía: Te mantendremos informado.\n\"Informar\" solo implica un flujo unidireccional de información de la Administración a los ciudadanos; sin embargo, es una base importante para la participación de la comunidad, ya que genera conocimiento y permite a los ciudadanos comprender plenamente la acción y la decisión y llegar a sus propias conclusiones en cuanto a la idoneidad y adecuación de la decisión. \n\"Informar\" es apropiado en situaciones en las que la ciudadanía no tiene la oportunidad de influir en la toma de decisiones. "]
[]
[null,"2. Consultar",null,null,null,"Objetivo de participación ciudadana: Obtener puntualmente la opinión de la ciudadanía y resto de agentes en cualquier fase de la estrategia, así como recoger sus propuestas y alternativas. "]
[null,null,null,null,null,"Compromiso con la ciudadanía: Escucharemos y reconoceremos sus aportaciones y brindaremos retroalimentación sobre cómo las mismas influyeron en la decisión.\n\"Consultar\" se enfoca en la retroalimentación y es la oportunidad mínima básica para la participación del público en una decisión: la administración obtiene retroalimentación sobre planes,  ideas, opciones o problemas, pero con poca interacción. \n\"Consultar\" es apropiado cuando se buscan aportes específicos de los ciudadanos para la toma de decisiones, así como votaciones y priorizaciones en un momento concreto. "]
[]
[null,"3. Implicar",null,null,null,"Objetivo de participación ciudadana: Trabajar con la ciudadanía y resto de agentes durante todo el proceso para asegurarse de que las opiniones, preocupaciones y aspiraciones sean consideradas y comprendidas."]
[null,null,null,null,null,"Compromiso con la ciudadanía: trabajaremos juntos para asegurarnos de que sus preocupaciones y aspiraciones se reflejen directamente en las alternativas desarrolladas.\n\"Implicar\" es un intercambio de información bidireccional que fomenta espacios de discusión y brinda la oportunidad de influir en la estrategia.  Los agentes están presentes en el proceso generalmente desde el principio y se le brindan múltiples o continuas oportunidades de aportación a medida que avanza la toma de decisiones. En este nivel, la toma de decisiones, generalmente. sigue estanto en manos de la Administración.\n\"Implicar\" es apropiado cuando no se abordan conflictos profundos o problemáticas muy complejas y se dispone de capacidad para trabajar con la ciudadanía. "]
[]
[null,"4. Colaborar",null,null,null,"Objetivo de participación ciudadana: Asociarse con la ciudadanía y resto de agentes en cada aspecto de la toma de decisiones."]
[null,null,null,null,null,"Compromiso con la ciudadanía: Estarás presente en todo el proceso para obtener asesoramiento directo e innovación en la formulación de soluciones e incorporar tus opiones, aportaciones concretas y recomendaciones en las decisiones en la mayor medida posible.\n\"Colaborar\" implica que el público está directamente involucrado en la toma de decisiones y está involucrado en un proceso interactivo con énfasis en los procesos bidireccionales. En general, se persigue encontrar soluciones de consenso (no de mayorías) y se negocia el grado de peso de la ciuadanía y de la Administración en la toma de decisiones. Suelen ser procesos más complejos y largos, en los que hay que crear lazos de confianza y espacios de participación reconocidos, validados y legitimados por todos los agentes implicados. Espacios de participación estables, continuados y dotados incluso presupuestariamente. \n\"Colaborar\" es adecuado para abordar temas controvertidos y problemas complejos porque implica un alto nivel de participación."]
[]
[{"$f":"TABLAS!$AL$2","v":"BASES PARA LA ELABORACIÓN DE UNA ESTRATEGIA DE REHABILITACIÓN DEL ENTORNO CONSTRUIDO"}]
[null,null,null,null,null,null,null,null,null,null,null,null,null,null,null,null,null,null,null,null,null,null,null,null,{"$f":"IF($Y$2=\"\",\"\",$Y$2)","v":"ANEJO 1: PARTICIPACIÓN Y GOBERNANZA"}]
[null,null,null,null,null,null,null,null,null,null,null,null,null,null,null,null,null,null,null,{"$f":"TABLAS!$AL$4","v":""}]
[null,"Leyenda 2 - Espacios y órganos de participación"]
[]
[null,"GRUPOS EXISTENTES, NO GENERADOS ESPECÍFICAMENTE PARA LA ESTRATEGIA"]
[]
[null,null,null,"A1. Consejos municipales o ciudadanos",null,null,null,null,"Objetivos: Órganos consultivos con el objetivo de coordinar, estudiar, orientar, deliberar y dictaminar sobre asuntos dentro de determinado ámbito de interés municipal\nMiembros: Ciudadanía en general, agentes vecinales, representantes de colectivos, técnicos y políticos."]
[]
[null,"GRUPOS GENERADOS ESPECÍFICAMENTE PARA LA ESTRATEGIA"]
[]
[null,null,null,"B1. Grupo motor",null,null,null,null,"Objetivos: Ser el “motor” del proceso de participación. Dinamización e implicación directa con el proceso; feedback y detección de necesidades.\nMiembros: Es un grupo voluntario abierto de personas realmente implicadas en la estrategia, con las cuales es posible trabajar de forma continuada y que se responsabilizan de parte del proceso. Este conjunto de personas son a la vez fuente de información y núcleo del proceso. Se puede configurar teniendo en cuenta la presencia de miembros de los distintos grupos de población presentes en el municipio. \nPeriodicidad: Se reúnen frecuentemente, con más intensidad durante la redacción de la estratègia y la implementación de acciones concretas"]
[]
[null,null,null,"B2. Grupos o comisiones de trabajo",null,null,null,null,"Objetivos: Debate, reflexión, formación y elaboración de propuestas.\nMiembros: En general, grupos de ciudadanos y/o técnicos que surgen según necesidad o interès concreto. En este caso pueden formarse en torno a los Objetivos, las Líneas de Actuación o las acciones. También pueden ser grupos que ya están trabajando sectorialmente en el municipio y pueden constituirse en meses por ámbitos (movilidad, cultura, urbanismo, vivienda,etc.) \nPeriodicidad: Se reúnen períodicamente o según necesidades y acciones en marcha"]
[]
[null,null,null,"B3. Comisión de seguimiento",null,null,null,null,"Objetivos: Velar por la transparència y el buen funcionamiento del proceso, estableciéndose como espacio formal de interlocución, negociación y mediación entre ciudadanía y Administración. \nMiembros: Representantes del grupo motor, portavoces de las comisiones de trabajo, representantes de entidades, asociaciones y colectivos ciudadanos, representantes de la Administración (políticos y técnicos)\nPeriodicidad: En momentos puntuales durante la redacción e implementación de la estratègia (mínimo una vez al año o al final de cada fase)"]
[]
[null,"Leyenda 3 - Gestión participada de espacios"]
[]
[null,"A. GESTIÓN NO PARTICIPADA",null,null,null,null,null,null,"La Administración o una entidad privada gestiona el espacio, infraestructura o servicio y es la responsable de su mantenimiento y financiación.\nLa ciudadanía es usuaria."]
[]
[null,"B. GESTIÓN PARTICIPADA",null,null,null,null,null,null,"Administración, ciudadanía o entidades privadas comparten recursos y gestionan colaborativamente, con distintos pesos en la participación, según acuerdo previo."]
[]
[null,null,null,"B1. Colaboración público-privada",null,null,null,null,"Gestión en la cual la Administración Pública colabora con una o varias empresas o endidades privadas. Existen distintos tipos de colaboración que pueden adquirir distintas forma jurídicas: convenios, partenariados, consorcios, fundaciones de capital mixto, etc."]
[]
[null,null,null,"B2. Gestión cívica o ciudadana",null,null,null,null,"Instrumento de colaboración entre la administración y la sociedad civil organizada, que permite a la ciudadanía implicarse en la gestión de espacios, equipamientos y servicios públicos\nLa ciudadanía y otros agentes sociales junto con la Administración gestionan el espacio y aportan recursos financieros, humanos, tecnológicos y operativos. El peso que tengan cada una de las partes marcará si se aproxima más a modelos de Co-gestión en los que la Administración aporta muchos recursos e incluso personal propio, o a modelos de Autogestión ciudadana en los que la Administración  puede ser simplemente el agente que cede el espacio para el uso comunitario, o aportar otra clase de recursos o ayudas de forma puntual."]

{"sheet":"TABLAS","index":14,"n_rows":543,"n_cols":38,"rows_kept":543,"cut":false,"hidden":true,"merged":[]}
["AÑO","TRIMESTRE","DAFO","ACCIONES","Municipio (alfabéticamente)","Ámbito geográfico","Prioridad","Municipio","Código Municipio","Provincia","Comarca","Poblacion del Municipio","Riesgo de despoblación","TIPO\nVulnerabilidad\nESPACIO URBANO SENSIBLE","EUS \nÁreas con Espacios urbanos sensibles","NIVEL vulnerabilidad inundación","NIVEL vulnerabilidad sismo","NIVEL Alquiler tensionado","ANHA Áreas de Necesidad de Vivienda (ANHA PONDERADO)","Ámbito territorial de precio máximo superior ATPMS \n","Superficie (km²)",null,"Planeamiento vigente",null,"PARQUE EDIFICATORIO Conservación","PARQUE EDIFICATORIO Accesibilidad","PARQUE EDIFICATORIO Eficiencia energética",null,"URBANIZACIÓN",null,"ETAPA IV",null,"VERSIÓN",null,null,null,null,"TÍTULOS"]
[2021,"T1","EJE 1","X","Ademuz","Totalidad del municipio",1,"Atzúbia, l'","03001","Alicante","La Marina Alta",632,"No","Polivulnerabilidad baja","No","Media","Media","Normal","-","A",14.67,null,"Plan general",null,"¿Se encuentra en uso?","Presenta barreras","Cerificado",null,"Diseño / Conservación",null,"Vigente",null,"1.0",null,null,null,null,"BASES PARA LA ELABORACIÓN DE UNA ESTRATEGIA DE REHABILITACIÓN DEL ENTORNO CONSTRUIDO"]
[2022,"T2","EJE 2",null,"Ador","Una o varias áreas del municipio",2,"Agost","03002","Alicante","L'Alacantí",4758,"No","Polivulnerabilidad baja","No","Alta","Alta","Normal","-","A",66.635000000000005,null,"Normas subsidiarias",null,"Sí","No","Carece",null,"Muy alto",null,"Sí",null,null,null,null,null,null,"ETAPA I: IDENTIFICACIÓN DEL ÁMBITO"]
[2023,"T3","EJE 3",null,"Agost","Áreas intermunicipales",3,"Agres","03003","Alicante","El Comtat",565,"No","Vulnerabilidad residual","No","Baja","Alta","Normal","-","A",25.837,null,null,null,"No, con previsión de uso próximo","Sí","A",null,"Alto",null,"No",null,null,null,null,null,null,{"$f":"IF('ETAPA I'!$B$6=\"\",\"\",'ETAPA I'!$B$6)","v":""}]
[2024,"T4","EJE 4",null,"Agres",null,null,"Aigües","03004","Alicante","L'Alacantí",963,"No","Polivulnerabilidad baja","No","Media","Alta","Normal","Baja","A",18.472999999999999,null,null,null,"No, sin previsión de uso próximo",null,"B",null,"Medio",null,null,null,null,null,null,null,null,"ETAPA II: ANÁLISIS Y DIAGNÓSTICO"]
[2025,null,"EJE 5",null,"Agullent",null,null,"Albatera","03005","Alicante","El Baix Segura / La Vega Baja",12279,"No","Polivulnerabilidad baja","No","Media","Alta","Normal","Media","A",61.542999999999999,null,null,null,null,"Instalacion ascensor","C",null,"Bajo",null,"Estado",null,null,null,null,null,null,"ETAPA III: PROGRAMA DE ACTUACIONES"]
[2026,null,"EJE 6",null,"Aielo de Malferit",null,null,"Alcalalí","03006","Alicante","La Marina Alta",1278,"No","Polivulnerabilidad baja","No","Media","Media","Normal","Media","A",14.398,null,null,null,"Nivel de mantenimiento","En hueco de escalera ","D",null,"Muy bajo",null,"A desarrollar",null,null,null,null,null,null,"ETAPA IV: IMPLEMENTACIÓN"]
[2027,null,"EJE 7",null,"Aielo de Rugat",null,null,"Alcocer de Planes","03007","Alicante","El Comtat",230,"No","Vulnerabilidad residual","No","Baja","Alta","Normal","-","A",4.3869999999999996,null,null,null,"Adecuado","En zona escalera con replanteo de la escalera","E",null,null,null,"En redacción",null,null,null,null,null,null,"ANEJO 1: PARTICIPACIÓN Y GOBERNANZA"]
[2028,null,"EJE 8",null,"Aigües",null,null,"Alcoleja","03008","Alicante","El Comtat",173,"Si","Polivulnerabilidad media","Si","Baja","Alta","Normal","-","A",14.558999999999999,null,null,null,"Regular","En patio interior","F",null,null,null,"En tramitación"]
[2029,null,"EJE 9",null,"Aín",null,null,"Alcoy/Alcoi","03009","Alicante","L'Alcoià",58994,"No","Polivulnerabilidad baja","No","Media","Media","Normal","Media","C-1",129.86099999999999,null,null,null,"Deficiente","En fachada con ocupación de la vía pública","G"]
[2030,null,"EJE 10",null,"Alaquàs",null,null,"Alfafara","03010","Alicante","El Comtat",410,"No","Vulnerabilidad residual","No","Media","Alta","Normal","-","A",19.777999999999999,null,null,null,"Nulo",null,"Mejora envolvente",null,null,null,null,"Proyecto",null,null,"Ejecución obra"]
[null,null,null,null,"Albaida",null,null,"Alfàs del Pi, l'","03011","Alicante","La Marina Baixa",20482,"No","Vulnerabilidad integral","Si","Alta","Media","Alto","Baja","A",19.260000000000002,null,null,null,null,null,"No es necesario (orientativo >2013)",null,null,null,"Tipo de contrato","Contratación","Redacción","Supervisión","Contatación","Ejecucción"]
[null,null,"DAFO ESCOGIDOS",null,"Albal",null,null,"Algorfa","03012","Alicante","El Baix Segura / La Vega Baja",2935,"No","Polivulnerabilidad baja","No","Alta","Alta","Normal","-","A",18.471,null,null,null,"Estado de consevación",null,"Baja (orientativo 2006 - 2013)",null,null,null,"Menor","1-2 (1-4 en urb.)","1-2","1-2","1-4","1-3"]
[null,null,{"$f":"IF('ETAPA II.h'!A6=\"þ\",TABLAS!C2,\"\")","v":""},null,"Albalat de la Ribera",null,null,"Algueña","03013","Alicante","El Vinalopó Mitjà / El Vinalopó Medio",1336,"No","Polivulnerabilidad media","Si","Media","Media","Normal","-","A",18.433,null,null,null,"Bueno",null,"Media (orientativo 1980 - 2006)",null,null,null,"Mayor","3-6","2-8","1-2","2-8","2-24"]
[null,null,{"$f":"IF('ETAPA II.h'!A56=\"þ\",TABLAS!C3,\"\")","v":""},null,"Albalat dels Sorells",null,null,"Alicante/Alacant","03014","Alicante","L'Alacantí",334887,"No","Polivulnerabilidad baja","No","Media","Media","Alto","-","A-2",201.26599999999999,null,null,null,"Regular",null,"Alta (orientativo < 1980)"]
[null,null,{"$f":"IF('ETAPA II.h'!A108=\"þ\",TABLAS!C4,\"\")","v":""},null,"Albalat dels Tarongers",null,null,"Almoradí","03015","Alicante","El Baix Segura / La Vega Baja",20803,"No","Vulnerabilidad integral","Si","Alta","Alta","Normal","-","C-2",42.694000000000003,null,null,null,"Deficiente"]
[null,null,{"$f":"IF('ETAPA II.h'!A159=\"þ\",TABLAS!C5,\"\")","v":""},null,"Albatera",null,null,"Almudaina","03016","Alicante","El Comtat",113,"Si","Polivulnerabilidad baja","No","Media","Alta","Normal","-","A",8.82,null,null,null,null,null,"Mejora clima"]
[null,null,{"$f":"IF('ETAPA II.h'!A210=\"þ\",TABLAS!C6,\"\")","v":""},null,"Alberic",null,null,"Alqueria d'Asnar, l'","03017","Alicante","El Comtat",493,"No","Vulnerabilidad residual","No","Media","Alta","Normal","-","A",1.0840000000000001,null,null,null,null,null,"No es necesario (orientativo >2013)"]
[null,null,{"$f":"IF('ETAPA II.h'!A261=\"þ\",TABLAS!C7,\"\")","v":""},null,"Albocàsser",null,null,"Altea","03018","Alicante","La Marina Baixa",22290,"No","Polivulnerabilidad media","No","Media","Media","Alto","-","C-1",34.427999999999997,null,null,null,null,null,"Baja (orientativo 2006 - 2013)"]
[null,null,{"$f":"IF('ETAPA II.h'!A312=\"þ\",TABLAS!C8,\"\")","v":""},null,"Alborache",null,null,"Aspe","03019","Alicante","El Vinalopó Mitjà / El Vinalopó Medio",20714,"No","Polivulnerabilidad media","Si","Media","Alta","Normal","-","C-1",70.570999999999998,null,null,null,null,null,"Media (orientativo 1980 - 2006)"]
[null,null,{"$f":"IF('ETAPA II.h'!A364=\"þ\",TABLAS!C9,\"\")","v":""},null,"Alboraia/Alboraya",null,null,"Balones","03020","Alicante","El Comtat",131,"Si","Vulnerabilidad residual","No","Baja","Alta","Normal","-","A",11.25,null,null,null,null,null,"Alta (orientativo < 1980)"]
[null,null,{"$f":"IF('ETAPA II.h'!A415=\"þ\",TABLAS!C10,\"\")","v":""},null,"Albuixech",null,null,"Banyeres de Mariola","03021","Alicante","L'Alcoià",7068,"No","Polivulnerabilidad baja","No","Baja","Media","Normal","-","A",50.276000000000003]
[null,null,{"$f":"IF('ETAPA II.h'!A466=\"þ\",TABLAS!C11,\"\")","v":""},null,"Alcalà de Xivert",null,null,"Benasau","03022","Alicante","El Comtat",151,"Si","Polivulnerabilidad baja","No","Baja","Alta","Normal","-","A",9.0399999999999991]
[null,null,null,null,"Alcalalí",null,null,"Beneixama","03023","Alicante","L'Alt Vinalopó / Alto Vinalopó",1685,"No","Polivulnerabilidad baja","No","Alta","Alta","Normal","-","A",34.887999999999998]
[null,null,"DAFO FILTRADOS",null,"Alcàntera de Xúquer",null,null,"Benejúzar","03024","Alicante","El Baix Segura / La Vega Baja",5402,"No","Vulnerabilidad integral","Si","Alta","Alta","Normal","-","A",9.3279999999999994]
[null,null,null,null,"Alcàsser",null,null,"Benferri","03025","Alicante","El Baix Segura / La Vega Baja",1942,"No","Polivulnerabilidad baja","No","Alta","Alta","Normal","Alta","A",12.362]
[null,null,{"$f":"IFERROR(_xlfn._xlws.FILTER(C14:C23,C14:C23<>\"\"),\"\")","v":""},null,"Alcocer de Planes",null,null,"Beniarbeig","03026","Alicante","La Marina Alta",2092,"No","Polivulnerabilidad media","Si","Alta","Media","Alto","Media","A",7.4029999999999996,null,null,null,"Proceso participativo","II.b","II.c","II.e","II.f","III.c"]
[null,null,null,null,"Alcoleja",null,null,"Beniardá","03027","Alicante","La Marina Baixa",232,"Si","Polivulnerabilidad baja","No","Baja","Media","Normal","-","A",15.739000000000001,null,null,null,"Sí, con ambas","Titularidad edificios","Tipología edificatoria","Estado de conservación mayoritario","Antigüedad mayoritaria","Calificación energética"]
[null,null,null,null,"Alcora, l'",null,null,"Beniarrés","03028","Alicante","El Comtat",1118,"Si","Polivulnerabilidad baja","No","Media","Alta","Normal","Media","A",20.213999999999999,null,null,null,"Se ha alcanzado un elevado grado de consenso con las administraciones territoriales involucradas","Mayoritariamente pública","Manzana cerrada","Bueno","< 1950","A"]
[null,null,null,null,"Alcoy/Alcoi",null,null,"Benigembla","03029","Alicante","La Marina Alta",490,"No","Polivulnerabilidad media","Si","Media","Media","Normal","Alta","A",18.454000000000001,null,null,null,"Se ha alcanzado un elevado grado de consenso con los sectores civiles y económicos involucrados","Mayoritariamente privada","Edificación aislada/exenta. Bloques","Regular","1950 - 1979","B"]
[null,null,null,null,"Alcublas",null,null,"Benidoleig","03030","Alicante","La Marina Alta",1095,"No","Polivulnerabilidad media","Si","Alta","Media","Normal","Baja","A",7.484,null,null,null,"No, pero nos encontramos en proceso de lograrlo","Incluye edificios de titularidad pública y privada","Antigüedad mayoritaria","Malo/Deficiente/Ruinoso","> 1980","C"]
[null,null,null,null,"Alcúdia de Crespins, l'",null,null,"Benidorm","03031","Alicante","La Marina Baixa",68721,"No","Polivulnerabilidad media","No","Alta","Media","Alto","Media","B",38.51,null,null,null,"Ningún consenso de momento","Índice medio pobreza energética","Anterior a 1950",null,"Tipología edificatoria","D"]
[null,null,null,null,"Alcudia de Veo",null,null,"Benifallim","03032","Alicante","L'Alcoià",105,"Si","Vulnerabilidad residual","No","Baja","Alta","Normal","-","A",13.688000000000001,null,null,null,null,"Bajo","Entre 1950 y 1979",null,"Manz. cerrada","E"]
[null,null,null,null,"Alcúdia, l'",null,null,"Benifato","03033","Alicante","La Marina Baixa",140,"No","Polivulnerabilidad baja","No","Baja","Media","Normal","-","A",11.881,null,null,null,null,"Medio","Posterior a 1980",null,"Aislada. Bloq.","No procede"]
[null,null,null,null,"Aldaia",null,null,"Benijófar","03034","Alicante","El Baix Segura / La Vega Baja",3322,"No","Polivulnerabilidad media","Si","Alta","Alta","Alto","-","A",4.3600000000000003,null,null,null,null,"Alto","Estado de conservación mayoritario",null,"Estado de conservación mayoritario"]
[null,null,null,null,"Alfafar",null,null,"Benilloba","03035","Alicante","El Comtat",724,"No","Polivulnerabilidad baja","No","Baja","Alta","Normal","-","A",9.5380000000000003,null,null,null,null,null,"Bueno",null,"Bueno"]
[null,null,null,null,"Alfafara",null,null,"Benillup","03036","Alicante","El Comtat",97,"Si","Polivulnerabilidad baja","No","Baja","Alta","Normal","Alta","A",3.379,null,null,null,null,null,"Regular",null,"Regular"]
[null,null,null,null,"Alfara de la Baronia",null,null,"Benimantell","03037","Alicante","La Marina Baixa",483,"No","Polivulnerabilidad baja","No","Baja","Alta","Normal","-","A",37.927999999999997,null,null,null,null,null,"Malo/Deficiente/Ruinoso",null,"Deficiente"]
[null,null,null,null,"Alfara del Patriarca",null,null,"Benimarfull","03038","Alicante","El Comtat",409,"No","Vulnerabilidad residual","No","Media","Alta","Normal","-","A",5.5640000000000001]
[null,null,null,null,"Alfarp",null,null,"Benimassot","03039","Alicante","El Comtat",106,"Si","Polivulnerabilidad baja","No","Baja","Alta","Normal","-","A",9.5129999999999999]
[null,null,null,null,"Alfarrasí",null,null,"Benimeli","03040","Alicante","La Marina Alta",418,"No","Polivulnerabilidad media","Si","Alta","Media","Normal","-","A",3.5049999999999999]
[null,null,null,null,"Alfàs del Pi, l'",null,null,"Benissa","03041","Alicante","La Marina Alta",11005,"No","Polivulnerabilidad baja","No","Media","Media","Normal","-","A",69.706999999999994]
[null,null,null,null,"Alfauir",null,null,"Benitachell/Poble Nou de Benitatxell, el","03042","Alicante","La Marina Alta",4276,"No","Polivulnerabilidad media","Si","Baja","Media","Alto","-","A",12.654]
[null,null,null,null,"Alfondeguilla",null,null,"Biar","03043","Alicante","L'Alt Vinalopó / Alto Vinalopó",3671,"No","Vulnerabilidad residual","No","Media","Alta","Normal","-","A",98.165000000000006]
[null,null,null,null,"Algar de Palancia",null,null,"Bigastro","03044","Alicante","El Baix Segura / La Vega Baja",6733,"No","Polivulnerabilidad baja","No","Alta","Alta","Normal","-","A",4.0979999999999999]
[null,null,null,null,"Algemesí",null,null,"Bolulla","03045","Alicante","La Marina Baixa",420,"No","Polivulnerabilidad baja","No","Baja","Media","Normal","-","A",13.571999999999999]
[null,null,null,null,"Algímia d'Alfara",null,null,"Busot","03046","Alicante","L'Alacantí",2978,"No","Vulnerabilidad residual","No","Media","Media","Normal","-","A",33.841999999999999]
[null,null,null,null,"Algimia de Almonacid",null,null,"Calp","03047","Alicante","La Marina Alta",22725,"No","Polivulnerabilidad media","Si","Alta","Baja","Alto","-","C-1",23.509]
[null,null,null,null,"Alginet",null,null,"Callosa d'en Sarrià","03048","Alicante","La Marina Baixa",7373,"No","Polivulnerabilidad media","Si","Media","Media","Normal","-","A",34.661999999999999]
[null,null,null,null,"Algorfa",null,null,"Callosa de Segura","03049","Alicante","El Baix Segura / La Vega Baja",19038,"No","Vulnerabilidad integral","Si","Alta","Alta","Normal","-","A",24.832000000000001]
[null,null,null,null,"Algueña",null,null,"Campello, el","03050","Alicante","L'Alacantí",28349,"No","Vulnerabilidad residual","No","Alta","Media","Alto","-","B",55.268000000000001]
[null,null,null,null,"Alicante/Alacant",null,null,"Campo de Mirra/Camp de Mirra, el","03051","Alicante","L'Alt Vinalopó / Alto Vinalopó",415,"No","Polivulnerabilidad media","Si","Baja","Alta","Normal","-","A",21.815999999999999]
[null,null,null,null,"Almàssera",null,null,"Cañada","03052","Alicante","L'Alt Vinalopó / Alto Vinalopó",1220,"No","Vulnerabilidad residual","No","Alta","Media","Normal","-","A",19.324000000000002]
[null,null,null,null,"Almassora",null,null,"Castalla","03053","Alicante","L'Alcoià",10124,"No","Vulnerabilidad residual","No","Media","Media","Normal","Media","C-2",114.6]
[null,null,null,null,"Almedíjar",null,null,"Castell de Castells","03054","Alicante","La Marina Alta",449,"Si","Polivulnerabilidad media","Si","Baja","Alta","Normal","-","A",45.927]
[null,null,null,null,"Almenara",null,null,"Catral","03055","Alicante","El Baix Segura / La Vega Baja",8639,"No","Polivulnerabilidad media","Si","Alta","Alta","Normal","-","A",20.007999999999999]
[null,null,null,null,"Almiserà",null,null,"Cocentaina","03056","Alicante","El Comtat",11511,"No","Polivulnerabilidad baja","No","Media","Alta","Normal","-","A",52.945]
[null,null,null,null,"Almoines",null,null,"Confrides","03057","Alicante","La Marina Baixa",187,"Si","Vulnerabilidad integral","Si","Baja","Alta","Normal","-","A",39.982999999999997]
[null,null,null,null,"Almoradí",null,null,"Cox","03058","Alicante","El Baix Segura / La Vega Baja",7297,"No","Vulnerabilidad integral","Si","Alta","Alta","Normal","-","A",16.71]
[null,null,null,null,"Almudaina",null,null,"Crevillent","03059","Alicante","El Baix Vinalopó",28952,"No","Vulnerabilidad integral","Si","Alta","Alta","Normal","-","C-1",104.55]
[null,null,null,null,"Almussafes",null,null,"Quatretondeta","03060","Alicante","El Comtat",122,"Si","Polivulnerabilidad baja","No","Media","Alta","Normal","-","A",16.704999999999998]
[null,null,null,null,"Alpuente",null,null,"Daya Nueva","03061","Alicante","El Baix Segura / La Vega Baja",1737,"No","Vulnerabilidad integral","Si","Alta","Alta","Normal","-","A",7.093]
[null,null,null,null,"Alqueria d'Asnar, l'",null,null,"Daya Vieja","03062","Alicante","El Baix Segura / La Vega Baja",690,"No","Vulnerabilidad integral","Si","Alta","Alta","Normal","Media","A",3.1429999999999998]
[null,null,null,null,"Alqueria de la Comtessa, l'",null,null,"Dénia","03063","Alicante","La Marina Alta",42166,"No","Polivulnerabilidad media","Si","Alta","Media","Alto","-","C-1",66.179000000000002]
[null,null,null,null,"Alqueries, les/Alquerías del Niño Perdido",null,null,"Dolores","03064","Alicante","El Baix Segura / La Vega Baja",7470,"No","Vulnerabilidad integral","Si","Alta","Alta","Normal","-","A",18.701000000000001]
[null,null,null,null,"Altea",null,null,"Elche/Elx","03065","Alicante","El Baix Vinalopó",232517,"No","Polivulnerabilidad media","Si","Media","Alta","Alto","-","B",326.50099999999998]
[null,null,null,null,"Altura",null,null,"Elda","03066","Alicante","El Vinalopó Mitjà / El Vinalopó Medio",52618,"No","Polivulnerabilidad media","Si","Alta","Media","Normal","-","C-1",45.789000000000001]
[null,null,null,null,"Alzira",null,null,"Facheca","03067","Alicante","El Comtat",106,"Si","Polivulnerabilidad media","Si","Baja","Alta","Normal","-","A",10.175000000000001]
[null,null,null,null,"Andilla",null,null,"Famorca","03068","Alicante","El Comtat",47,"Si","Polivulnerabilidad media","Si","Baja","Alta","Normal","-","A",9.7240000000000002]
[null,null,null,null,"Anna",null,null,"Finestrat","03069","Alicante","La Marina Baixa",6715,"No","Polivulnerabilidad baja","No","Alta","Media","Alto","Alta","A",42.253999999999998]
[null,null,null,null,"Antella",null,null,"Formentera del Segura","03070","Alicante","El Baix Segura / La Vega Baja",4191,"No","Vulnerabilidad integral","Si","Alta","Alta","Normal","-","A",4.3319999999999999]
[null,null,null,null,"Arañuel",null,null,"Gata de Gorgos","03071","Alicante","La Marina Alta",6049,"No","Vulnerabilidad integral","Si","Media","Media","Normal","Media","A",20.332000000000001]
[null,null,null,null,"Aras de los Olmos",null,null,"Gaianes","03072","Alicante","El Comtat",452,"No","Polivulnerabilidad baja","No","Alta","Alta","Normal","-","A",9.5709999999999997]
[null,null,null,null,"Ares del Maestrat",null,null,"Gorga","03073","Alicante","El Comtat",249,"No","Polivulnerabilidad media","No","Alta","Alta","Normal","-","A",9.1069999999999993]
[null,null,null,null,"Argelita",null,null,"Granja de Rocamora","03074","Alicante","El Baix Segura / La Vega Baja",2580,"No","Vulnerabilidad integral","Si","Alta","Alta","Normal","Alta","A",7.1689999999999996]
[null,null,null,null,"Artana",null,null,"Castell de Guadalest, el","03075","Alicante","La Marina Baixa",217,"No","Polivulnerabilidad baja","No","Baja","Alta","Normal","-","A",15.96]
[null,null,null,null,"Aspe",null,null,"Guardamar del Segura","03076","Alicante","El Baix Segura / La Vega Baja",15348,"No","Polivulnerabilidad media","Si","Media","Alta","Alto","Baja","C-1",33.936999999999998]
[null,null,null,null,"Atzeneta d'Albaida",null,null,"Fondó de les Neus, el/Hondón de las Nieves","03077","Alicante","El Vinalopó Mitjà / El Vinalopó Medio",2544,"No","Polivulnerabilidad baja","No","Alta","Alta","Normal","Media","A",68.852000000000004]
[null,null,null,null,"Atzeneta del Maestrat",null,null,"Hondón de los Frailes","03078","Alicante","El Vinalopó Mitjà / El Vinalopó Medio",1198,"No","Polivulnerabilidad baja","No","Media","Alta","Normal","-","A",12.545999999999999]
[null,null,null,null,"Atzúbia, l'",null,null,"Ibi","03079","Alicante","L'Alcoià",23489,"No","Polivulnerabilidad baja","No","Alta","Alta","Normal","-","C-2",62.524000000000001]
[null,null,null,null,"Ayódar",null,null,"Jacarilla","03080","Alicante","El Baix Segura / La Vega Baja",2022,"No","Polivulnerabilidad media","Si","Media","Alta","Normal","Media","A",12.204000000000001]
[null,null,null,null,"Ayora",null,null,"Xaló","03081","Alicante","La Marina Alta",2739,"No","Vulnerabilidad integral","Si","Alta","Media","Normal","-","A",34.585999999999999]
[null,null,null,null,"Azuébar",null,null,"Jávea/Xàbia","03082","Alicante","La Marina Alta",27604,"No","Polivulnerabilidad baja","No","Alta","Baja","Alto","-","C-1",68.59]
[null,null,null,null,"Balones",null,null,"Jijona/Xixona","03083","Alicante","L'Alacantí",6865,"No","Polivulnerabilidad media","No","Baja","Alta","Normal","-","A",163.761]
[null,null,null,null,"Banyeres de Mariola",null,null,"Lorcha/Orxa, l'","03084","Alicante","El Comtat",578,"Si","Polivulnerabilidad baja","No","Alta","Alta","Normal","-","A",31.765000000000001]
[null,null,null,null,"Barracas",null,null,"Llíber","03085","Alicante","La Marina Alta",935,"No","Polivulnerabilidad baja","No","Alta","Media","Normal","-","A",21.933]
[null,null,null,null,"Barx",null,null,"Millena","03086","Alicante","El Comtat",237,"No","Polivulnerabilidad baja","No","Baja","Alta","Normal","Media","A",9.7729999999999997]
[null,null,null,null,"Barxeta",null,null,"Monforte del Cid","03088","Alicante","El Vinalopó Mitjà / El Vinalopó Medio",8165,"No","Polivulnerabilidad media","No","Media","Alta","Normal","-","C-1",79.522000000000006]
[null,null,null,null,"Bejís",null,null,"Monóvar/Monòver","03089","Alicante","El Vinalopó Mitjà / El Vinalopó Medio",12167,"No","Polivulnerabilidad media","Si","Media","Alta","Normal","-","A",152.357]
[null,null,null,null,"Bèlgida",null,null,"Mutxamel","03090","Alicante","L'Alacantí",25352,"No","Vulnerabilidad residual","No","Media","Media","Alto","-","B",47.652999999999999]
[null,null,null,null,"Bellreguard",null,null,"Murla","03091","Alicante","La Marina Alta",470,"No","Polivulnerabilidad baja","No","Baja","Media","Normal","-","A",5.8129999999999997]
[null,null,null,null,"Bellús",null,null,"Muro de Alcoy","03092","Alicante","El Comtat",9324,"No","Vulnerabilidad residual","No","Alta","Alta","Normal","Baja","A",30.244]
[null,null,null,null,"Benafer",null,null,"Novelda","03093","Alicante","El Vinalopó Mitjà / El Vinalopó Medio",25651,"No","Polivulnerabilidad media","Si","Media","Alta","Normal","-","C-1",75.724000000000004]
[null,null,null,null,"Benafigos",null,null,"Nucia, la","03094","Alicante","La Marina Baixa",18603,"No","Polivulnerabilidad baja","No","Media","Media","Alto","Media","A",21.361000000000001]
[null,null,null,null,"Benagéber",null,null,"Ondara","03095","Alicante","La Marina Alta",6894,"No","Vulnerabilidad integral","Si","Alta","Media","Normal","-","A",10.413]
[null,null,null,null,"Benaguasil",null,null,"Onil","03096","Alicante","L'Alcoià",7507,"No","Polivulnerabilidad baja","No","Alta","Media","Normal","-","C-2",48.41]
[null,null,null,null,"Benasau",null,null,"Orba","03097","Alicante","La Marina Alta",2174,"No","Polivulnerabilidad media","Si","Media","Media","Normal","-","A",17.73]
[null,null,null,null,"Benassal",null,null,"Orxeta","03098","Alicante","La Marina Baixa",736,"No","Polivulnerabilidad baja","No","Media","Media","Normal","-","A",24.062000000000001]
[null,null,null,null,"Benavites",null,null,"Orihuela","03099","Alicante","El Baix Segura / La Vega Baja",77414,"No","Vulnerabilidad integral","Si","Alta","Alta","Alto","-","C-1",365.43599999999998]
[null,null,null,null,"Beneixama",null,null,"Parcent","03100","Alicante","La Marina Alta",929,"No","Polivulnerabilidad media","Si","Media","Media","Normal","-","A",11.77]
[null,null,null,null,"Beneixida",null,null,"Pedreguer","03101","Alicante","La Marina Alta",7699,"No","Polivulnerabilidad baja","No","Alta","Media","Normal","-","A",29.582000000000001]
[null,null,null,null,"Benejúzar",null,null,"Pego","03102","Alicante","La Marina Alta",10128,"No","Polivulnerabilidad baja","No","Media","Media","Normal","-","A",52.847000000000001]
[null,null,null,null,"Benetússer",null,null,"Penàguila","03103","Alicante","L'Alcoià",292,"Si","Vulnerabilidad residual","No","Baja","Alta","Normal","-","A",49.924999999999997]
[null,null,null,null,"Benferri",null,null,"Petrer","03104","Alicante","El Vinalopó Mitjà / El Vinalopó Medio",34276,"No","Polivulnerabilidad media","No","Media","Media","Alto","-","C-1",104.09099999999999]
[null,null,null,null,"Beniarbeig",null,null,"Pinós, el/Pinoso","03105","Alicante","El Vinalopó Mitjà / El Vinalopó Medio",7966,"No","Polivulnerabilidad media","Si","Alta","Media","Normal","-","A",126.479]
[null,null,null,null,"Beniardá",null,null,"Planes","03106","Alicante","El Comtat",693,"Si","Polivulnerabilidad baja","No","Baja","Alta","Normal","-","A",38.868000000000002]
[null,null,null,null,"Beniarjó",null,null,"Polop","03107","Alicante","La Marina Baixa",4965,"No","Polivulnerabilidad baja","No","Alta","Media","Normal","-","A",22.559000000000001]
[null,null,null,null,"Beniarrés",null,null,"Rafal","03109","Alicante","El Baix Segura / La Vega Baja",4498,"No","Vulnerabilidad integral","Si","Alta","Alta","Normal","-","A",1.6220000000000001]
[null,null,null,null,"Beniatjar",null,null,"Ràfol d'Almúnia, el","03110","Alicante","La Marina Alta",653,"No","Polivulnerabilidad media","Si","Media","Media","Normal","Baja","A",4.8780000000000001]
[null,null,null,null,"Benicarló",null,null,"Redován","03111","Alicante","El Baix Segura / La Vega Baja",7869,"No","Vulnerabilidad integral","Si","Alta","Alta","Normal","-","A",9.4480000000000004]
[null,null,null,null,"Benicasim/Benicàssim",null,null,"Relleu","03112","Alicante","La Marina Baixa",1160,"No","Polivulnerabilidad baja","No","Baja","Alta","Normal","-","A",76.872]
[null,null,null,null,"Benicolet",null,null,"Rojales","03113","Alicante","El Baix Segura / La Vega Baja",16963,"No","Vulnerabilidad integral","Si","Alta","Alta","Normal","-","A",27.728999999999999]
[null,null,null,null,"Benicull de Xúquer",null,null,"Romana, la","03114","Alicante","El Vinalopó Mitjà / El Vinalopó Medio",2434,"No","Polivulnerabilidad media","Si","Media","Alta","Normal","-","A",43.293999999999997]
[null,null,null,null,"Benidoleig",null,null,"Sagra","03115","Alicante","La Marina Alta",408,"Si","Polivulnerabilidad media","Si","Alta","Media","Normal","-","A",5.6189999999999998]
[null,null,null,null,"Benidorm",null,null,"Salinas","03116","Alicante","L'Alt Vinalopó / Alto Vinalopó",1601,"No","Polivulnerabilidad media","No","Alta","Media","Normal","-","A",61.712000000000003]
[null,null,null,null,"Benifaió",null,null,"Sanet y Negrals","03117","Alicante","La Marina Alta",667,"No","Polivulnerabilidad media","Si","Media","Media","Normal","Baja","A",3.9420000000000002]
[null,null,null,null,"Benifairó de la Valldigna",null,null,"San Fulgencio","03118","Alicante","El Baix Segura / La Vega Baja",7855,"No","Polivulnerabilidad media","Si","Alta","Alta","Normal","-","A",20.701000000000001]
[null,null,null,null,"Benifairó de les Valls",null,null,"Sant Joan d'Alacant","03119","Alicante","L'Alacantí",23915,"No","Vulnerabilidad residual","No","Media","Media","Alto","Alta","B",9.6389999999999993]
[null,null,null,null,"Benifallim",null,null,"San Miguel de Salinas","03120","Alicante","El Baix Segura / La Vega Baja",6034,"No","Vulnerabilidad integral","Si","Media","Alta","Normal","-","A",54.845999999999997]
[null,null,null,null,"Benifato",null,null,"Santa Pola","03121","Alicante","El Baix Vinalopó",32306,"No","Polivulnerabilidad baja","No","Alta","Alta","Alto","-","C-1",58.161000000000001]
[null,null,null,null,"Beniflá",null,null,"San Vicente del Raspeig/Sant Vicent del Raspeig","03122","Alicante","L'Alacantí",58385,"No","Polivulnerabilidad baja","No","Media","Media","Alto","-","B",40.551000000000002]
[null,null,null,null,"Benigànim",null,null,"Sax","03123","Alicante","L'Alt Vinalopó / Alto Vinalopó",9845,"No","Polivulnerabilidad media","Si","Media","Media","Normal","-","A",63.484000000000002]
[null,null,null,null,"Benigembla",null,null,"Sella","03124","Alicante","La Marina Baixa",580,"No","Polivulnerabilidad baja","No","Baja","Alta","Normal","-","A",38.720999999999997]
[null,null,null,null,"Benijófar",null,null,"Senija","03125","Alicante","La Marina Alta",584,"No","Vulnerabilidad integral","Si","Media","Media","Normal","-","A",4.7859999999999996]
[null,null,null,null,"Benilloba",null,null,"Tàrbena","03127","Alicante","La Marina Baixa",646,"Si","Vulnerabilidad integral","Si","Baja","Media","Normal","-","A",31.67]
[null,null,null,null,"Benillup",null,null,"Teulada","03128","Alicante","La Marina Alta",11112,"No","Polivulnerabilidad media","Si","Media","Media","Alto","-","A",32.25]
[null,null,null,null,"Benimantell",null,null,"Tibi","03129","Alicante","L'Alcoià",1614,"No","Vulnerabilidad residual","No","Baja","Media","Normal","Alta","A",70.382999999999996]
[null,null,null,null,"Benimarfull",null,null,"Tollos","03130","Alicante","El Comtat",57,"Si","Polivulnerabilidad baja","No","Baja","Alta","Normal","Baja","A",15.973000000000001]
[null,null,null,null,"Benimassot",null,null,"Tormos","03131","Alicante","La Marina Alta",340,"No","Vulnerabilidad residual","No","Baja","Alta","Normal","-","A",5.36]
[null,null,null,null,"Benimeli",null,null,"Torremanzanas/Torre de les Maçanes, la","03132","Alicante","L'Alacantí",661,"No","Polivulnerabilidad baja","No","Baja","Alta","Normal","Alta","A",36.479999999999997]
[null,null,null,null,"Benimodo",null,null,"Torrevieja","03133","Alicante","El Baix Segura / La Vega Baja",83337,"No","Polivulnerabilidad media","Si","Media","Alta","Alto","-","A",71.760000000000005]
[null,null,null,null,"Benimuslem",null,null,"Vall d'Alcalà, la","03134","Alicante","La Marina Alta",167,"Si","Polivulnerabilidad media","No","Baja","Alta","Normal","-","C-1",22.850999999999999]
[null,null,null,null,"Beniparrell",null,null,"Vall d'Ebo, la","03135","Alicante","La Marina Alta",216,"Si","Vulnerabilidad residual","No","Alta","Media","Normal","-","A",32.424999999999997]
[null,null,null,null,"Benirredrà",null,null,"Vall de Gallinera","03136","Alicante","La Marina Alta",571,"Si","Vulnerabilidad residual","No","Media","Alta","Normal","-","A",53.633000000000003]
[null,null,null,null,"Benissa",null,null,"Vall de Laguar, la","03137","Alicante","La Marina Alta",846,"No","Polivulnerabilidad media","Si","Baja","Media","Normal","Baja","A",23.053999999999998]
[null,null,null,null,"Benissanó",null,null,"Verger, el","03138","Alicante","La Marina Alta",4640,"No","Polivulnerabilidad media","Si","Alta","Media","Normal","Baja","A",8.1590000000000007]
[null,null,null,null,"Benissoda",null,null,"Villajoyosa/Vila Joiosa, la","03139","Alicante","La Marina Baixa",34673,"No","Polivulnerabilidad media","Si","Media","Media","Alto","Media","A",59.247999999999998]
[null,null,null,null,"Benissuera",null,null,"Villena","03140","Alicante","L'Alt Vinalopó / Alto Vinalopó",33964,"No","Polivulnerabilidad media","Si","Alta","Media","Normal","-","C-1",345.37]
[null,null,null,null,"Benitachell/Poble Nou de Benitatxell, el",null,null,"Poblets, els","03901","Alicante","La Marina Alta",2705,"No","Polivulnerabilidad media","Si","Alta","Media","Normal","-","C-1",3.621]
[null,null,null,null,"Benlloc",null,null,"Pilar de la Horadada","03902","Alicante","El Baix Segura / La Vega Baja",21905,"No","Polivulnerabilidad media","Si","Alta","Alta","Normal","Baja","A",77.855000000000004]
[null,null,null,null,"Bétera",null,null,"Montesinos, Los","03903","Alicante","El Baix Segura / La Vega Baja",4968,"No","Vulnerabilidad integral","Si","Baja","Alta","Normal","Alta","A",14.99]
[null,null,null,null,"Betxí",null,null,"San Isidro","03904","Alicante","El Baix Segura / La Vega Baja",1986,"No","Polivulnerabilidad baja","No","Alta","Alta","Alto","-","A",11.699]
[null,null,null,null,"Biar",null,null,"Atzeneta del Maestrat","12001","Castellón/Castelló","L'Alcalatén",1276,"Si","Polivulnerabilidad baja","No","Alta","Baja","Normal","Alta","A",71.158000000000001]
[null,null,null,null,"Bicorp",null,null,"Aín","12002","Castellón/Castelló","La Plana Baixa",127,"Si","Vulnerabilidad residual","No","Baja","Baja","Normal","Media","A",12.29]
[null,null,null,null,"Bigastro",null,null,"Albocàsser","12003","Castellón/Castelló","L'Alt Maestrat",1241,"Si","Polivulnerabilidad baja","No","Media","Baja","Normal","Baja","A",82.292000000000002]
[null,null,null,null,"Bocairent",null,null,"Alcalà de Xivert","12004","Castellón/Castelló","El Baix Maestrat",6680,"No","Polivulnerabilidad media","Si","Alta","Baja","Normal","-","A",167.559]
[null,null,null,null,"Bolbaite",null,null,"Alcora, l'","12005","Castellón/Castelló","L'Alcalatén",10405,"No","Vulnerabilidad residual","No","Media","Baja","Normal","Alta","A",95.176000000000002]
[null,null,null,null,"Bolulla",null,null,"Alcudia de Veo","12006","Castellón/Castelló","La Plana Baixa",190,"No","Vulnerabilidad residual","No","Baja","Baja","Normal","Baja","A",30.658000000000001]
[null,null,null,null,"Bonrepòs i Mirambell",null,null,"Alfondeguilla","12007","Castellón/Castelló","La Plana Baixa",866,"No","Vulnerabilidad residual","No","Alta","Baja","Normal","Media","A",28.327999999999999]
[null,null,null,null,"Borriana/Burriana",null,null,"Algimia de Almonacid","12008","Castellón/Castelló","El Alto Palancia",263,"Si","Polivulnerabilidad baja","No","Baja","Baja","Normal","Media","A",20.332999999999998]
[null,null,null,null,"Borriol",null,null,"Almassora","12009","Castellón/Castelló","La Plana Alta",26270,"No","Vulnerabilidad residual","No","Alta","Baja","Normal","Baja","C-1",32.973999999999997]
[null,null,null,null,"Bufali",null,null,"Almedíjar","12010","Castellón/Castelló","El Alto Palancia",254,"Si","Vulnerabilidad residual","No","Alta","Baja","Normal","-","A",20.899000000000001]
[null,null,null,null,"Bugarra",null,null,"Almenara","12011","Castellón/Castelló","La Plana Baixa",5998,"No","Vulnerabilidad residual","No","Alta","Baja","Normal","Alta","A",27.626000000000001]
[null,null,null,null,"Buñol",null,null,"Altura","12012","Castellón/Castelló","El Alto Palancia",3528,"No","Vulnerabilidad residual","No","Media","Baja","Normal","Media","A",129.565]
[null,null,null,null,"Burjassot",null,null,"Arañuel","12013","Castellón/Castelló","El Alto Mijares",150,"Si","Polivulnerabilidad baja","No","Media","Baja","Normal","Alta","A",19.161000000000001]
[null,null,null,null,"Busot",null,null,"Ares del Maestrat","12014","Castellón/Castelló","L'Alt Maestrat",186,"Si","Polivulnerabilidad media","Si","Baja","Baja","Normal","Alta","A",118.669]
[null,null,null,null,"Cabanes",null,null,"Argelita","12015","Castellón/Castelló","El Alto Mijares",118,"Si","Polivulnerabilidad baja","No","Media","Baja","Normal","Alta","A",15.47]
[null,null,null,null,"Càlig",null,null,"Artana","12016","Castellón/Castelló","La Plana Baixa",1947,"No","Polivulnerabilidad baja","No","Media","Baja","Normal","Alta","A",36.331000000000003]
[null,null,null,null,"Calles",null,null,"Ayódar","12017","Castellón/Castelló","El Alto Mijares",159,"Si","Polivulnerabilidad media","Si","Media","Baja","Normal","Alta","A",24.364000000000001]
[null,null,null,null,"Callosa de Segura",null,null,"Azuébar","12018","Castellón/Castelló","El Alto Palancia",315,"Si","Vulnerabilidad residual","No","Alta","Baja","Normal","-","A",23.401]
[null,null,null,null,"Callosa d'en Sarrià",null,null,"Barracas","12020","Castellón/Castelló","El Alto Palancia",162,"No","Polivulnerabilidad baja","No","Alta","Baja","Normal","Media","A",42.149000000000001]
[null,null,null,null,"Calp",null,null,"Betxí","12021","Castellón/Castelló","La Plana Baixa",5645,"No","Vulnerabilidad residual","No","Alta","Baja","Normal","-","A",21.44]
[null,null,null,null,"Campello, el",null,null,"Bejís","12022","Castellón/Castelló","El Alto Palancia",380,"Si","Polivulnerabilidad baja","No","Baja","Baja","Normal","Baja","A",42.353000000000002]
[null,null,null,null,"Campo de Mirra/Camp de Mirra, el",null,null,"Benafer","12024","Castellón/Castelló","El Alto Palancia",152,"No","Vulnerabilidad residual","No","Media","Baja","Normal","-","A",17.033000000000001]
[null,null,null,null,"Camporrobles",null,null,"Benafigos","12025","Castellón/Castelló","L'Alcalatén",142,"Si","Polivulnerabilidad baja","No","Baja","Baja","Normal","Alta","A",35.6]
[null,null,null,null,"Canals",null,null,"Benassal","12026","Castellón/Castelló","L'Alt Maestrat",1068,"Si","Polivulnerabilidad baja","No","Media","Baja","Alto","-","A",79.578000000000003]
[null,null,null,null,"Canet d'En Berenguer",null,null,"Benicarló","12027","Castellón/Castelló","El Baix Maestrat",26912,"No","Polivulnerabilidad media","Si","Alta","Baja","Normal","Media","C-1",47.863999999999997]
[null,null,null,null,"Canet lo Roig",null,null,"Benicasim/Benicàssim","12028","Castellón/Castelló","La Plana Alta",18192,"No","Vulnerabilidad residual","No","Alta","Baja","Alto","Media","B",36.228999999999999]
[null,null,null,null,"Cañada",null,null,"Benlloc","12029","Castellón/Castelló","La Plana Alta",1033,"No","Polivulnerabilidad baja","No","Media","Baja","Normal","Alta","A",43.521999999999998]
[null,null,null,null,"Carcaixent",null,null,"Borriol","12031","Castellón/Castelló","La Plana Alta",5360,"No","Vulnerabilidad residual","No","Media","Baja","Normal","Baja","C-1",61.555999999999997]
[null,null,null,null,"Càrcer",null,null,"Borriana/Burriana","12032","Castellón/Castelló","La Plana Baixa",34683,"No","Polivulnerabilidad baja","No","Alta","Baja","Normal","Media","B",46.994]
[null,null,null,null,"Carlet",null,null,"Cabanes","12033","Castellón/Castelló","La Plana Alta",2958,"No","Polivulnerabilidad baja","No","Alta","Baja","Normal","Media","A",131.637]
[null,null,null,null,"Carrícola",null,null,"Càlig","12034","Castellón/Castelló","El Baix Maestrat",1950,"No","Polivulnerabilidad media","Si","Media","Baja","Normal","Baja","A",27.466000000000001]
[null,null,null,null,"Casas Altas",null,null,"Canet lo Roig","12036","Castellón/Castelló","El Baix Maestrat",674,"Si","Polivulnerabilidad baja","No","Baja","Baja","Normal","-","A",68.680000000000007]
[null,null,null,null,"Casas Bajas",null,null,"Castell de Cabres","12037","Castellón/Castelló","El Baix Maestrat",17,"Si","Polivulnerabilidad baja","No","Baja","Baja","Normal","-","A",30.721]
[null,null,null,null,"Casinos",null,null,"Castellfort","12038","Castellón/Castelló","Els Ports",183,"Si","Vulnerabilidad residual","No","Baja","Baja","Normal","-","A",66.736999999999995]
[null,null,null,null,"Castalla",null,null,"Castellnovo","12039","Castellón/Castelló","El Alto Palancia",917,"Si","Vulnerabilidad residual","No","Media","Baja","Normal","-","A",19.202999999999999]
[null,null,null,null,"Castell de Cabres",null,null,"Castellón de la Plana/Castelló de la Plana","12040","Castellón/Castelló","La Plana Alta",171728,"No","Vulnerabilidad residual","No","Alta","Baja","Alto","Baja","A-2",111.325]
[null,null,null,null,"Castell de Castells",null,null,"Castillo de Villamalefa","12041","Castellón/Castelló","El Alto Mijares",107,"Si","Vulnerabilidad integral","Si","Baja","Baja","Normal","-","A",37.74]
[null,null,null,null,"Castell de Guadalest, el",null,null,"Catí","12042","Castellón/Castelló","L'Alt Maestrat",721,"Si","Polivulnerabilidad baja","No","Alta","Baja","Normal","Media","A",102.346]
[null,null,null,null,"Castellfort",null,null,"Caudiel","12043","Castellón/Castelló","El Alto Palancia",664,"Si","Polivulnerabilidad baja","No","Alta","Baja","Normal","-","A",62.381]
[null,null,null,null,"Castellnovo",null,null,"Cervera del Maestre","12044","Castellón/Castelló","El Baix Maestrat",575,"Si","Vulnerabilidad integral","Si","Baja","Baja","Normal","Media","A",93.234999999999999]
[null,null,null,null,"Castelló de Rugat",null,null,"Cinctorres","12045","Castellón/Castelló","Els Ports",391,"Si","Polivulnerabilidad baja","No","Baja","Baja","Normal","-","A",35.064]
[null,null,null,null,"Castellón de la Plana/Castelló de la Plana",null,null,"Cirat","12046","Castellón/Castelló","El Alto Mijares",201,"Si","Vulnerabilidad residual","No","Baja","Baja","Normal","Media","A",41.1]
[null,null,null,null,"Castellonet de la Conquesta",null,null,"Cortes de Arenoso","12048","Castellón/Castelló","El Alto Mijares",318,"Si","Polivulnerabilidad baja","No","Baja","Baja","Normal","-","A",80.587000000000003]
[null,null,null,null,"Castielfabib",null,null,"Costur","12049","Castellón/Castelló","L'Alcalatén",524,"No","Vulnerabilidad residual","No","Baja","Baja","Normal","Alta","A",21.93]
[null,null,null,null,"Castillo de Villamalefa",null,null,"Coves de Vinromà, les","12050","Castellón/Castelló","La Plana Alta",1823,"Si","Polivulnerabilidad media","Si","Media","Baja","Normal","Alta","A",136.43600000000001]
[null,null,null,null,"Catadau",null,null,"Culla","12051","Castellón/Castelló","L'Alt Maestrat",495,"Si","Polivulnerabilidad media","No","Baja","Baja","Normal","Media","A",115.85899999999999]
[null,null,null,null,"Catarroja",null,null,"Xert","12052","Castellón/Castelló","El Baix Maestrat",701,"Si","Polivulnerabilidad baja","No","Baja","Baja","Normal","-","A",82.509]
[null,null,null,null,"Catí",null,null,"Chilches/Xilxes","12053","Castellón/Castelló","La Plana Baixa",2679,"No","Vulnerabilidad residual","No","Alta","Baja","Normal","Media","A",13.581]
[null,null,null,null,"Catral",null,null,"Chodos/Xodos","12055","Castellón/Castelló","L'Alcalatén",112,"Si","Polivulnerabilidad baja","No","Baja","Baja","Normal","Alta","A",44.265999999999998]
[null,null,null,null,"Caudete de las Fuentes",null,null,"Chóvar","12056","Castellón/Castelló","El Alto Palancia",288,"Si","Vulnerabilidad residual","No","Baja","Baja","Normal","-","A",18.309000000000001]
[null,null,null,null,"Caudiel",null,null,"Eslida","12057","Castellón/Castelló","La Plana Baixa",759,"No","Polivulnerabilidad baja","No","Alta","Baja","Normal","Media","A",18.125]
[null,null,null,null,"Cerdà",null,null,"Espadilla","12058","Castellón/Castelló","El Alto Mijares",71,"Si","Vulnerabilidad residual","No","Baja","Baja","Normal","-","A",11.964]
[null,null,null,null,"Cervera del Maestre",null,null,"Fanzara","12059","Castellón/Castelló","El Alto Mijares",267,"Si","Vulnerabilidad residual","No","Alta","Baja","Normal","-","A",34.975999999999999]
[null,null,null,null,"Chella",null,null,"Figueroles","12060","Castellón/Castelló","L'Alcalatén",523,"No","Vulnerabilidad residual","No","Baja","Baja","Normal","Media","A",12.089]
[null,null,null,null,"Chelva",null,null,"Forcall","12061","Castellón/Castelló","Els Ports",465,"Si","Polivulnerabilidad media","No","Media","Baja","Normal","-","A",39.206000000000003]
[null,null,null,null,"Chera",null,null,"Fuente la Reina","12063","Castellón/Castelló","El Alto Mijares",52,"Si","Vulnerabilidad residual","No","Baja","Baja","Normal","-","A",7.5]
[null,null,null,null,"Cheste",null,null,"Fuentes de Ayódar","12064","Castellón/Castelló","El Alto Mijares",87,"Si","Vulnerabilidad residual","No","Baja","Baja","Normal","-","A",10.983000000000001]
[null,null,null,null,"Chilches/Xilxes",null,null,"Gaibiel","12065","Castellón/Castelló","El Alto Palancia",188,"Si","Vulnerabilidad integral","Si","Alta","Baja","Normal","Alta","A",18.077999999999999]
[null,null,null,null,"Chiva",null,null,"Geldo","12067","Castellón/Castelló","El Alto Palancia",635,"Si","Polivulnerabilidad media","No","Media","Baja","Normal","Baja","A",0.56299999999999994]
[null,null,null,null,"Chodos/Xodos",null,null,"Herbés","12068","Castellón/Castelló","Els Ports",42,"Si","Polivulnerabilidad media","No","Baja","Baja","Normal","Baja","A",27.117999999999999]
[null,null,null,null,"Chóvar",null,null,"Higueras","12069","Castellón/Castelló","El Alto Palancia",54,"Si","Polivulnerabilidad baja","No","Baja","Baja","Normal","Media","A",11.843999999999999]
[null,null,null,null,"Chulilla",null,null,"Jana, la","12070","Castellón/Castelló","El Baix Maestrat",675,"No","Polivulnerabilidad media","Si","Media","Baja","Normal","-","A",19.501999999999999]
[null,null,null,null,"Cinctorres",null,null,"Jérica","12071","Castellón/Castelló","El Alto Palancia",1548,"No","Vulnerabilidad residual","No","Media","Baja","Normal","-","A",78.275000000000006]
[null,null,null,null,"Cirat",null,null,"Llucena/Lucena del Cid","12072","Castellón/Castelló","L'Alcalatén",1302,"Si","Polivulnerabilidad baja","No","Baja","Baja","Normal","Alta","A",137.036]
[null,null,null,null,"Cocentaina",null,null,"Ludiente","12073","Castellón/Castelló","El Alto Mijares",141,"Si","Polivulnerabilidad baja","No","Media","Baja","Normal","-","A",31.350999999999999]
[null,null,null,null,"Cofrentes",null,null,"Llosa, la","12074","Castellón/Castelló","La Plana Baixa",951,"No","Polivulnerabilidad baja","No","Media","Baja","Normal","Media","A",10.032999999999999]
[null,null,null,null,"Confrides",null,null,"Mata de Morella, la","12075","Castellón/Castelló","Els Ports",166,"Si","Polivulnerabilidad media","No","Media","Baja","Normal","-","A",15.161]
[null,null,null,null,"Corbera",null,null,"Matet","12076","Castellón/Castelló","El Alto Palancia",84,"Si","Polivulnerabilidad media","Si","Media","Baja","Normal","Alta","A",14.888]
[null,null,null,null,"Cortes de Arenoso",null,null,"Moncofa","12077","Castellón/Castelló","La Plana Baixa",6525,"No","Vulnerabilidad residual","No","Alta","Baja","Alto","-","C-2",14.529]
[null,null,null,null,"Cortes de Pallás",null,null,"Montán","12078","Castellón/Castelló","El Alto Mijares",370,"Si","Polivulnerabilidad baja","No","Baja","Baja","Normal","-","A",34.097000000000001]
[null,null,null,null,"Costur",null,null,"Montanejos","12079","Castellón/Castelló","El Alto Mijares",572,"Si","Vulnerabilidad residual","No","Media","Baja","Normal","Baja","A",37.799999999999997]
[null,null,null,null,"Cotes",null,null,"Morella","12080","Castellón/Castelló","Els Ports",2430,"Si","Polivulnerabilidad media","No","Baja","Baja","Normal","Alta","A",413.53899999999999]
[null,null,null,null,"Coves de Vinromà, les",null,null,"Navajas","12081","Castellón/Castelló","El Alto Palancia",716,"No","Vulnerabilidad residual","No","Media","Baja","Normal","-","A",7.8879999999999999]
[null,null,null,null,"Cox",null,null,"Nules","12082","Castellón/Castelló","La Plana Baixa",13103,"No","Polivulnerabilidad baja","No","Alta","Baja","Normal","-","C-1",50.533999999999999]
[null,null,null,null,"Crevillent",null,null,"Olocau del Rey","12083","Castellón/Castelló","Els Ports",119,"Si","Polivulnerabilidad baja","No","Baja","Baja","Normal","Media","A",43.98]
[null,null,null,null,"Culla",null,null,"Onda","12084","Castellón/Castelló","La Plana Baixa",24859,"No","Polivulnerabilidad baja","No","Media","Baja","Normal","Media","C-1",108.20099999999999]
[null,null,null,null,"Cullera",null,null,"Oropesa del Mar/Orpesa","12085","Castellón/Castelló","La Plana Alta",9076,"No","Polivulnerabilidad media","No","Alta","Baja","Normal","Alta","A",26.422000000000001]
[null,null,null,null,"Daimús",null,null,"Palanques","12087","Castellón/Castelló","Els Ports",30,"Si","Polivulnerabilidad baja","No","Baja","Baja","Normal","Alta","A",14.321]
[null,null,null,null,"Daya Nueva",null,null,"Pavías","12088","Castellón/Castelló","El Alto Palancia",61,"Si","Vulnerabilidad residual","No","Baja","Baja","Normal","Alta","A",14.412000000000001]
[null,null,null,null,"Daya Vieja",null,null,"Peníscola/Peñíscola","12089","Castellón/Castelló","El Baix Maestrat",7612,"No","Polivulnerabilidad media","Si","Alta","Baja","Normal","-","A",78.974000000000004]
[null,null,null,null,"Dénia",null,null,"Pina de Montalgrao","12090","Castellón/Castelló","El Alto Palancia",111,"Si","Polivulnerabilidad baja","No","Baja","Baja","Normal","-","A",31.603000000000002]
[null,null,null,null,"Dolores",null,null,"Portell de Morella","12091","Castellón/Castelló","Els Ports",197,"Si","Polivulnerabilidad media","No","Baja","Baja","Normal","Alta","A",49.395000000000003]
[null,null,null,null,"Domeño",null,null,"Puebla de Arenoso","12092","Castellón/Castelló","El Alto Mijares",158,"Si","Polivulnerabilidad media","Si","Baja","Baja","Normal","-","A",42.529000000000003]
[null,null,null,null,"Dos Aguas",null,null,"Pobla de Benifassà, la","12093","Castellón/Castelló","El Baix Maestrat",202,"Si","Polivulnerabilidad baja","No","Baja","Baja","Normal","-","A",135.999]
[null,null,null,null,"Elche/Elx",null,null,"Pobla Tornesa, la","12094","Castellón/Castelló","La Plana Alta",1211,"No","Polivulnerabilidad baja","No","Baja","Baja","Normal","-","A",25.690999999999999]
[null,null,null,null,"Elda",null,null,"Ribesalbes","12095","Castellón/Castelló","La Plana Baixa",1174,"No","Polivulnerabilidad baja","No","Media","Baja","Normal","-","A",8.5399999999999991]
[null,null,null,null,"Eliana, l'",null,null,"Rossell","12096","Castellón/Castelló","El Baix Maestrat",937,"Si","Vulnerabilidad residual","No","Media","Baja","Normal","-","A",74.926000000000002]
[null,null,null,null,"Emperador",null,null,"Sacañet","12097","Castellón/Castelló","El Alto Palancia",67,"Si","Vulnerabilidad residual","No","Baja","Baja","Normal","Media","A",30.495999999999999]
[null,null,null,null,"Enguera",null,null,"Salzadella, la","12098","Castellón/Castelló","El Baix Maestrat",704,"Si","Polivulnerabilidad baja","No","Baja","Baja","Normal","-","A",49.92]
[null,null,null,null,"Ènova, l'",null,null,"Sant Jordi/San Jorge","12099","Castellón/Castelló","El Baix Maestrat",972,"No","Vulnerabilidad residual","No","Media","Baja","Normal","-","A",36.494]
[null,null,null,null,"Eslida",null,null,"Sant Mateu","12100","Castellón/Castelló","El Baix Maestrat",1963,"No","Polivulnerabilidad baja","No","Media","Baja","Normal","-","A",64.623999999999995]
[null,null,null,null,"Espadilla",null,null,"San Rafael del Río","12101","Castellón/Castelló","El Baix Maestrat",469,"Si","Polivulnerabilidad media","Si","Baja","Baja","Normal","Baja","A",21.151]
[null,null,null,null,"Estivella",null,null,"Santa Magdalena de Pulpis","12102","Castellón/Castelló","El Baix Maestrat",768,"No","Polivulnerabilidad baja","No","Alta","Baja","Normal","-","A",66.484999999999999]
[null,null,null,null,"Estubeny",null,null,"Serratella, la","12103","Castellón/Castelló","La Plana Alta",101,"Si","Polivulnerabilidad media","No","Baja","Baja","Normal","-","A",18.812000000000001]
[null,null,null,null,"Facheca",null,null,"Segorbe","12104","Castellón/Castelló","El Alto Palancia",8978,"No","Vulnerabilidad residual","No","Media","Baja","Normal","-","C-2",106.08]
[null,null,null,null,"Famorca",null,null,"Sierra Engarcerán","12105","Castellón/Castelló","La Plana Alta",976,"Si","Polivulnerabilidad baja","No","Media","Baja","Normal","Alta","A",81.98]
[null,null,null,null,"Fanzara",null,null,"Soneja","12106","Castellón/Castelló","El Alto Palancia",1447,"No","Vulnerabilidad residual","No","Baja","Baja","Normal","-","A",29.105]
[null,null,null,null,"Faura",null,null,"Sot de Ferrer","12107","Castellón/Castelló","El Alto Palancia",415,"No","Vulnerabilidad residual","No","Media","Baja","Normal","Alta","A",8.64]
[null,null,null,null,"Favara",null,null,"Sueras/Suera","12108","Castellón/Castelló","La Plana Baixa",525,"No","Vulnerabilidad residual","No","Baja","Baja","Normal","Media","A",22.22]
[null,null,null,null,"Figueroles",null,null,"Tales","12109","Castellón/Castelló","La Plana Baixa",825,"No","Vulnerabilidad residual","No","Media","Baja","Alto","-","A",14.525]
[null,null,null,null,"Finestrat",null,null,"Teresa","12110","Castellón/Castelló","El Alto Palancia",242,"Si","Polivulnerabilidad baja","No","Media","Baja","Normal","-","A",19.885999999999999]
[null,null,null,null,"Foios",null,null,"Tírig","12111","Castellón/Castelló","L'Alt Maestrat",419,"Si","Polivulnerabilidad baja","No","Media","Baja","Normal","-","A",42.335999999999999]
[null,null,null,null,"Fondó de les Neus, el/Hondón de las Nieves",null,null,"Todolella","12112","Castellón/Castelló","Els Ports",155,"Si","Vulnerabilidad residual","No","Baja","Baja","Normal","Baja","A",34.024999999999999]
[null,null,null,null,"Font de la Figuera, la",null,null,"Toga","12113","Castellón/Castelló","El Alto Mijares",100,"Si","Vulnerabilidad residual","No","Baja","Baja","Normal","Alta","A",13.523999999999999]
[null,null,null,null,"Font d'En Carròs, la",null,null,"Torás","12114","Castellón/Castelló","El Alto Palancia",223,"Si","Vulnerabilidad residual","No","Baja","Baja","Normal","Media","A",16.783999999999999]
[null,null,null,null,"Fontanars dels Alforins",null,null,"Toro, El","12115","Castellón/Castelló","El Alto Palancia",256,"Si","Polivulnerabilidad media","Si","Baja","Baja","Normal","-","A",109.95099999999999]
[null,null,null,null,"Forcall",null,null,"Torralba del Pinar","12116","Castellón/Castelló","El Alto Mijares",69,"Si","Vulnerabilidad residual","No","Baja","Baja","Normal","Baja","A",21.193000000000001]
[null,null,null,null,"Formentera del Segura",null,null,"Torreblanca","12117","Castellón/Castelló","La Plana Alta",5528,"No","Polivulnerabilidad media","Si","Alta","Baja","Normal","Media","A",29.814]
[null,null,null,null,"Fortaleny",null,null,"Torrechiva","12118","Castellón/Castelló","El Alto Mijares",81,"Si","Vulnerabilidad residual","No","Baja","Baja","Normal","-","A",11.848000000000001]
[null,null,null,null,"Fuente la Reina",null,null,"Torre d'En Besora, la","12119","Castellón/Castelló","L'Alt Maestrat",158,"Si","Polivulnerabilidad baja","No","Baja","Baja","Normal","Baja","A",12.31]
[null,null,null,null,"Fuenterrobles",null,null,"Torre d'en Doménec, la","12120","Castellón/Castelló","La Plana Alta",180,"Si","Polivulnerabilidad baja","No","Baja","Baja","Normal","-","A",3.1859999999999999]
[null,null,null,null,"Fuentes de Ayódar",null,null,"Traiguera","12121","Castellón/Castelló","El Baix Maestrat",1378,"No","Polivulnerabilidad baja","No","Baja","Baja","Normal","-","A",59.758000000000003]
[null,null,null,null,"Gaianes",null,null,"Useras/Useres, les","12122","Castellón/Castelló","L'Alcalatén",962,{"$error":"#N/A"},"Polivulnerabilidad baja","No","Media","Baja","Normal","-","A",80.686000000000007]
[null,null,null,null,"Gaibiel",null,null,"Vallat","12123","Castellón/Castelló","El Alto Mijares",49,"Si","Vulnerabilidad residual","No","Alta","Baja","Normal","-","A",5.0049999999999999]
[null,null,null,null,"Gandia",null,null,"Vall d'Alba","12124","Castellón/Castelló","La Plana Alta",2807,"No","Polivulnerabilidad baja","No","Media","Baja","Normal","-","A",52.915999999999997]
[null,null,null,null,"Gata de Gorgos",null,null,"Vall de Almonacid","12125","Castellón/Castelló","El Alto Palancia",269,"Si","Vulnerabilidad residual","No","Baja","Baja","Normal","-","A",21.12]
[null,null,null,null,"Gátova",null,null,"Vall d'Uixó, la","12126","Castellón/Castelló","La Plana Baixa",31660,"No","Vulnerabilidad residual","No","Media","Baja","Normal","Media","C-1",67.081000000000003]
[null,null,null,null,"Gavarda",null,null,"Vallibona","12127","Castellón/Castelló","Els Ports",69,"Si","Vulnerabilidad residual","No","Baja","Baja","Normal","-","A",91.370999999999995]
[null,null,null,null,"Geldo",null,null,"Vilafamés","12128","Castellón/Castelló","La Plana Alta",1842,"No","Vulnerabilidad residual","No","Media","Baja","Normal","-","A",70.545000000000002]
[null,null,null,null,"Genovés, el",null,null,"Vilafranca/Villafranca del Cid","12129","Castellón/Castelló","L'Alt Maestrat",2200,{"$error":"#N/A"},"Polivulnerabilidad baja","No","Baja","Baja","Normal","Media","A",93.844999999999999]
[null,null,null,null,"Gestalgar",null,null,"Villahermosa del Río","12130","Castellón/Castelló","El Alto Mijares",489,"Si","Polivulnerabilidad baja","No","Media","Baja","Normal","Media","A",108.88500000000001]
[null,null,null,null,"Gilet",null,null,"Villamalur","12131","Castellón/Castelló","El Alto Mijares",62,"Si","Polivulnerabilidad baja","No","Baja","Baja","Normal","-","A",19.475000000000001]
[null,null,null,null,"Godella",null,null,"Vilanova d'Alcolea","12132","Castellón/Castelló","La Plana Alta",584,"Si","Polivulnerabilidad baja","No","Baja","Baja","Normal","-","A",68.409000000000006]
[null,null,null,null,"Godelleta",null,null,"Villanueva de Viver","12133","Castellón/Castelló","El Alto Mijares",61,"Si","Polivulnerabilidad baja","No","Baja","Baja","Normal","-","A",5.9470000000000001]
[null,null,null,null,"Gorga",null,null,"Vilar de Canes","12134","Castellón/Castelló","L'Alt Maestrat",169,"Si","Polivulnerabilidad media","No","Baja","Baja","Normal","Alta","A",15.91]
[null,null,null,null,"Granja de la Costera, la",null,null,"Vila-real","12135","Castellón/Castelló","La Plana Baixa",50893,"No","Vulnerabilidad residual","No","Media","Baja","Alto","Baja","B",55.122999999999998]
[null,null,null,null,"Granja de Rocamora",null,null,"Vilavella, la","12136","Castellón/Castelló","La Plana Baixa",3157,"No","Polivulnerabilidad baja","No","Baja","Baja","Alto","-","A",6.1459999999999999]
[null,null,null,null,"Guadasséquies",null,null,"Villores","12137","Castellón/Castelló","Els Ports",39,"Si","Polivulnerabilidad baja","No","Media","Baja","Normal","-","A",5.3049999999999997]
[null,null,null,null,"Guadassuar",null,null,"Vinaròs","12138","Castellón/Castelló","El Baix Maestrat",28682,"No","Polivulnerabilidad media","Si","Alta","Baja","Alto","Baja","C-1",95.454999999999998]
[null,null,null,null,"Guardamar de la Safor",null,null,"Vistabella del Maestrat","12139","Castellón/Castelló","L'Alcalatén",339,"Si","Polivulnerabilidad baja","No","Baja","Baja","Normal","Baja","A",150.995]
[null,null,null,null,"Guardamar del Segura",null,null,"Viver","12140","Castellón/Castelló","El Alto Palancia",1536,"No","Vulnerabilidad residual","No","Alta","Baja","Normal","-","A",49.926000000000002]
[null,null,null,null,"Herbés",null,null,"Zorita del Maestrazgo","12141","Castellón/Castelló","Els Ports",114,"Si","Polivulnerabilidad baja","No","Baja","Baja","Normal","-","A",68.832999999999998]
[null,null,null,null,"Higueras",null,null,"Zucaina","12142","Castellón/Castelló","El Alto Mijares",171,"Si","Polivulnerabilidad media","No","Baja","Baja","Normal","-","A",51.57]
[null,null,null,null,"Higueruelas",null,null,"Alqueries, les/Alquerías del Niño Perdido","12901","Castellón/Castelló","La Plana Baixa",4449,"No","Polivulnerabilidad baja","No","Media","Baja","Normal","-","C-1",12.61]
[null,null,null,null,"Hondón de los Frailes",null,null,"Sant Joan de Moró","12902","Castellón/Castelló","La Plana Alta",3159,"No","Polivulnerabilidad baja","No","Baja","Baja","Normal","-","A",28.664000000000001]
[null,null,null,null,"Ibi",null,null,"Ademuz","46001","Valencia/Valéncia","El Rincón de Ademuz",1042,"Si","Polivulnerabilidad media","Si","Media","Baja","Normal","-","A",100.41800000000001]
[null,null,null,null,"Jacarilla",null,null,"Ador","46002","Valencia/Valéncia","La Safor",1508,"No","Vulnerabilidad residual","No","Alta","Alta","Normal","Media","A",13.811999999999999]
[null,null,null,null,"Jalance",null,null,"Atzeneta d'Albaida","46003","Valencia/Valéncia","La Vall d'Albaida",1165,"No","Polivulnerabilidad baja","No","Baja","Media","Normal","-","A",6.056]
[null,null,null,null,"Jana, la",null,null,"Agullent","46004","Valencia/Valéncia","La Vall d'Albaida",2410,"No","Polivulnerabilidad baja","No","Baja","Alta","Normal","Media","A",16.239000000000001]
[null,null,null,null,"Jarafuel",null,null,"Alaquàs","46005","Valencia/Valéncia","L'Horta Oest",29561,"No","Polivulnerabilidad baja","No","Alta","Media","Alto","Baja","C-1",3.9020000000000001]
[null,null,null,null,"Jávea/Xàbia",null,null,"Albaida","46006","Valencia/Valéncia","La Vall d'Albaida",5900,"No","Polivulnerabilidad baja","No","Media","Alta","Normal","Media","A",35.414000000000001]
[null,null,null,null,"Jérica",null,null,"Albal","46007","Valencia/Valéncia","L'Horta Sud",16399,"No","Polivulnerabilidad baja","No","Alta","Media","Alto","-","C-1",7.3319999999999999]
[null,null,null,null,"Jijona/Xixona",null,null,"Albalat de la Ribera","46008","Valencia/Valéncia","La Ribera Baixa",3360,"No","Polivulnerabilidad media","Si","Alta","Alta","Normal","-","A",14.35]
[null,null,null,null,"Llanera de Ranes",null,null,"Albalat dels Sorells","46009","Valencia/Valéncia","L'Horta Nord",3977,"No","Polivulnerabilidad baja","No","Baja","Media","Alto","-","C-2",4.625]
[null,null,null,null,"Llaurí",null,null,"Albalat dels Tarongers","46010","Valencia/Valéncia","El Camp de Morvedre",1232,"No","Vulnerabilidad residual","No","Baja","Baja","Normal","-","A",21.344999999999999]
[null,null,null,null,"Llíber",null,null,"Alberic","46011","Valencia/Valéncia","La Ribera Alta",10526,"No","Polivulnerabilidad media","Si","Media","Alta","Normal","-","A",26.792000000000002]
[null,null,null,null,"Llíria",null,null,"Alborache","46012","Valencia/Valéncia","La Hoya de Buñol",1160,"No","Vulnerabilidad residual","No","Media","Media","Normal","-","A",27.331]
[null,null,null,null,"Llocnou de la Corona",null,null,"Alboraia/Alboraya","46013","Valencia/Valéncia","L'Horta Nord",24454,"No","Vulnerabilidad residual","No","Alta","Media","Alto","-","B",8.34]
[null,null,null,null,"Llocnou de Sant Jeroni",null,null,"Albuixech","46014","Valencia/Valéncia","L'Horta Nord",4017,"No","Polivulnerabilidad baja","No","Baja","Media","Alto","-","C-2",4.4189999999999996]
[null,null,null,null,"Llocnou d'En Fenollet",null,null,"Alcàsser","46015","Valencia/Valéncia","L'Horta Sud",10039,"No","Polivulnerabilidad baja","No","Alta","Media","Alto","Baja","C-1",9.0039999999999996]
[null,null,null,null,"Llombai",null,null,"Alcàntera de Xúquer","46016","Valencia/Valéncia","La Ribera Alta",1291,"No","Polivulnerabilidad baja","No","Alta","Alta","Normal","-","A",3.3250000000000002]
[null,null,null,null,"Llosa de Ranes, la",null,null,"Alzira","46017","Valencia/Valéncia","La Ribera Alta",44352,"No","Vulnerabilidad residual","No","Alta","Alta","Alto","-","C-1",110.49]
[null,null,null,null,"Llosa, la",null,null,"Alcublas","46018","Valencia/Valéncia","Los Serranos",628,"Si","Vulnerabilidad residual","No","Baja","Baja","Normal","Alta","A",43.512]
[null,null,null,null,"Llucena/Lucena del Cid",null,null,"Alcúdia, l'","46019","Valencia/Valéncia","La Ribera Alta",12009,"No","Vulnerabilidad residual","No","Alta","Alta","Normal","-","A",23.667000000000002]
[null,null,null,null,"Llutxent",null,null,"Alcúdia de Crespins, l'","46020","Valencia/Valéncia","La Costera",5157,"No","Polivulnerabilidad baja","No","Alta","Alta","Normal","Media","A",5.1680000000000001]
[null,null,null,null,"Lorcha/Orxa, l'",null,null,"Aldaia","46021","Valencia/Valéncia","L'Horta Oest",31864,"No","Polivulnerabilidad baja","No","Alta","Media","Alto","Alta","C-1",16.050999999999998]
[null,null,null,null,"Loriguilla",null,null,"Alfafar","46022","Valencia/Valéncia","L'Horta Sud",20890,"No","Polivulnerabilidad media","Si","Alta","Media","Alto","-","C-1",10.041]
[null,null,null,null,"Losa del Obispo",null,null,"Alfauir","46023","Valencia/Valéncia","La Safor",437,"No","Vulnerabilidad residual","No","Alta","Media","Normal","Alta","A",6.22]
[null,null,null,null,"Ludiente",null,null,"Alfara de la Baronia","46024","Valencia/Valéncia","El Camp de Morvedre",557,"No","Vulnerabilidad residual","No","Baja","Baja","Normal","Media","A",11.71]
[null,null,null,null,"Macastre",null,null,"Alfara del Patriarca","46025","Valencia/Valéncia","L'Horta Nord",3310,"No","Vulnerabilidad residual","No","Alta","Media","Alto","Media","C-2",1.9810000000000001]
[null,null,null,null,"Manises",null,null,"Alfarp","46026","Valencia/Valéncia","La Ribera Alta",1544,"No","Vulnerabilidad residual","No","Media","Media","Normal","-","A",20.577999999999999]
[null,null,null,null,"Manuel",null,null,"Alfarrasí","46027","Valencia/Valéncia","La Vall d'Albaida",1225,"No","Polivulnerabilidad baja","No","Baja","Alta","Normal","Baja","A",6.38]
[null,null,null,null,"Marines",null,null,"Algar de Palancia","46028","Valencia/Valéncia","El Camp de Morvedre",481,"No","Vulnerabilidad residual","No","Baja","Baja","Normal","Media","A",13.151]
[null,null,null,null,"Massalavés",null,null,"Algemesí","46029","Valencia/Valéncia","La Ribera Alta",27331,"No","Polivulnerabilidad baja","No","Alta","Alta","Normal","Baja","C-1",41.3]
[null,null,null,null,"Massalfassar",null,null,"Algímia d'Alfara","46030","Valencia/Valéncia","El Camp de Morvedre",1011,"No","Polivulnerabilidad media","Si","Media","Baja","Normal","Alta","A",14.452999999999999]
[null,null,null,null,"Massamagrell",null,null,"Alginet","46031","Valencia/Valéncia","La Ribera Alta",13380,"No","Polivulnerabilidad baja","No","Alta","Media","Normal","Baja","A",24.071999999999999]
[null,null,null,null,"Massanassa",null,null,"Almàssera","46032","Valencia/Valéncia","L'Horta Nord",7349,"No","Polivulnerabilidad baja","No","Baja","Media","Alto","-","C-1",2.7389999999999999]
[null,null,null,null,"Mata de Morella, la",null,null,"Almiserà","46033","Valencia/Valéncia","La Safor",262,"No","Polivulnerabilidad baja","No","Media","Media","Normal","-","A",7.44]
[null,null,null,null,"Matet",null,null,"Almoines","46034","Valencia/Valéncia","La Safor",2414,"No","Vulnerabilidad residual","No","Alta","Alta","Normal","-","A",2.1179999999999999]
[null,null,null,null,"Meliana",null,null,"Almussafes","46035","Valencia/Valéncia","La Ribera Baixa",8967,"No","Vulnerabilidad residual","No","Baja","Media","Alto","Baja","A",10.762]
[null,null,null,null,"Millares",null,null,"Alpuente","46036","Valencia/Valéncia","Los Serranos",633,"Si","Vulnerabilidad integral","Si","Media","Baja","Normal","Media","A",138.33000000000001]
[null,null,null,null,"Millena",null,null,"Alqueria de la Comtessa, l'","46037","Valencia/Valéncia","La Safor",1476,"No","Vulnerabilidad residual","No","Alta","Alta","Normal","Baja","A",2.153]
[null,null,null,null,"Miramar",null,null,"Andilla","46038","Valencia/Valéncia","Los Serranos",319,"Si","Polivulnerabilidad baja","No","Alta","Baja","Normal","-","A",142.77799999999999]
[null,null,null,null,"Mislata",null,null,"Anna","46039","Valencia/Valéncia","La Canal de Navarrés",2628,"No","Polivulnerabilidad media","No","Media","Media","Normal","-","A",21.449000000000002]
[null,null,null,null,"Mogente/Moixent",null,null,"Antella","46040","Valencia/Valéncia","La Ribera Alta",1175,"No","Vulnerabilidad residual","No","Alta","Alta","Normal","Media","A",17.579000000000001]
[null,null,null,null,"Moncada",null,null,"Aras de los Olmos","46041","Valencia/Valéncia","Los Serranos",381,"Si","Polivulnerabilidad media","Si","Media","Media","Normal","-","A",76.037000000000006]
[null,null,null,null,"Moncofa",null,null,"Aielo de Malferit","46042","Valencia/Valéncia","La Vall d'Albaida",4618,"No","Polivulnerabilidad baja","No","Baja","Alta","Normal","Media","A",26.739000000000001]
[null,null,null,null,"Monforte del Cid",null,null,"Aielo de Rugat","46043","Valencia/Valéncia","La Vall d'Albaida",155,"Si","Vulnerabilidad residual","No","Baja","Alta","Normal","Media","A",7.8310000000000004]
[null,null,null,null,"Monóvar/Monòver",null,null,"Ayora","46044","Valencia/Valéncia","El Valle de Cofrentes-Ayora",5312,"Si","Polivulnerabilidad baja","No","Alta","Media","Normal","-","A",446.57900000000001]
[null,null,null,null,"Montán",null,null,"Barxeta","46045","Valencia/Valéncia","La Costera",1601,"No","Polivulnerabilidad baja","No","Media","Media","Normal","Alta","A",28.518000000000001]
[null,null,null,null,"Montanejos",null,null,"Barx","46046","Valencia/Valéncia","La Safor",1277,"No","Polivulnerabilidad baja","No","Alta","Media","Normal","Baja","A",16.103000000000002]
[null,null,null,null,"Montaverner",null,null,"Bèlgida","46047","Valencia/Valéncia","La Vall d'Albaida",673,"No","Vulnerabilidad residual","No","Baja","Alta","Normal","-","A",17.262]
[null,null,null,null,"Montesa",null,null,"Bellreguard","46048","Valencia/Valéncia","La Safor",4608,"No","Vulnerabilidad residual","No","Alta","Alta","Alto","-","A",2.8519999999999999]
[null,null,null,null,"Montesinos, Los",null,null,"Bellús","46049","Valencia/Valéncia","La Vall d'Albaida",304,"No","Polivulnerabilidad media","Si","Baja","Alta","Normal","Alta","A",9.5399999999999991]
[null,null,null,null,"Montitxelvo/Montichelvo",null,null,"Benagéber","46050","Valencia/Valéncia","Los Serranos",192,"Si","Polivulnerabilidad baja","No","Baja","Baja","Normal","Baja","A",69.823999999999998]
[null,null,null,null,"Montroi/Montroy",null,null,"Benaguasil","46051","Valencia/Valéncia","El Camp de Túria",10988,"No","Polivulnerabilidad baja","No","Baja","Media","Normal","-","C-2",25.396000000000001]
[null,null,null,null,"Montserrat",null,null,"Benavites","46052","Valencia/Valéncia","El Camp de Morvedre",619,"No","Vulnerabilidad residual","No","Media","Baja","Normal","Alta","A",4.2699999999999996]
[null,null,null,null,"Morella",null,null,"Beneixida","46053","Valencia/Valéncia","La Ribera Alta",651,"No","Vulnerabilidad residual","No","Baja","Media","Normal","Alta","A",3.1960000000000002]
[null,null,null,null,"Murla",null,null,"Benetússer","46054","Valencia/Valéncia","L'Horta Sud",14799,"No","Polivulnerabilidad baja","No","Alta","Media","Alto","Baja","C-1",0.77900000000000003]
[null,null,null,null,"Muro de Alcoy",null,null,"Beniarjó","46055","Valencia/Valéncia","La Safor",1765,"No","Polivulnerabilidad baja","No","Alta","Alta","Normal","-","A",2.7509999999999999]
[null,null,null,null,"Museros",null,null,"Beniatjar","46056","Valencia/Valéncia","La Vall d'Albaida",223,"Si","Polivulnerabilidad baja","No","Baja","Alta","Normal","Baja","A",11.371]
[null,null,null,null,"Mutxamel",null,null,"Benicolet","46057","Valencia/Valéncia","La Vall d'Albaida",569,"No","Polivulnerabilidad baja","No","Media","Media","Normal","Media","A",11.291]
[null,null,null,null,"Nàquera/Náquera",null,null,"Benifairó de les Valls","46058","Valencia/Valéncia","El Camp de Morvedre",2186,"No","Vulnerabilidad residual","No","Media","Baja","Normal","Media","A",4.3449999999999998]
[null,null,null,null,"Navajas",null,null,"Benifairó de la Valldigna","46059","Valencia/Valéncia","La Safor",1571,"No","Polivulnerabilidad baja","No","Media","Alta","Normal","-","A",20.199000000000002]
[null,null,null,null,"Navarrés",null,null,"Benifaió","46060","Valencia/Valéncia","La Ribera Alta",11962,"No","Vulnerabilidad residual","No","Baja","Media","Normal","-","A",20.154]
[null,null,null,null,"Novelda",null,null,"Beniflá","46061","Valencia/Valéncia","La Safor",457,"No","Polivulnerabilidad baja","No","Baja","Alta","Normal","Alta","A",0.625]
[null,null,null,null,"Novelé/Novetlè",null,null,"Benigànim","46062","Valencia/Valéncia","La Vall d'Albaida",5841,"No","Polivulnerabilidad baja","No","Baja","Alta","Normal","Baja","A",33.439]
[null,null,null,null,"Nucia, la",null,null,"Benimodo","46063","Valencia/Valéncia","La Ribera Alta",2268,"No","Polivulnerabilidad baja","No","Baja","Alta","Normal","Alta","A",12.522]
[null,null,null,null,"Nules",null,null,"Benimuslem","46064","Valencia/Valéncia","La Ribera Alta",653,"No","Polivulnerabilidad baja","No","Alta","Alta","Normal","Baja","A",4.17]
[null,null,null,null,"Oliva",null,null,"Beniparrell","46065","Valencia/Valéncia","L'Horta Sud",1952,"No","Vulnerabilidad residual","No","Alta","Media","Alto","-","C-1",3.6179999999999999]
[null,null,null,null,"Olleria, l'",null,null,"Benirredrà","46066","Valencia/Valéncia","La Safor",1592,"No","Polivulnerabilidad baja","No","Alta","Media","Alto","Media","A",0.38900000000000001]
[null,null,null,null,"Olocau",null,null,"Benissanó","46067","Valencia/Valéncia","El Camp de Túria",2260,"No","Polivulnerabilidad baja","No","Baja","Baja","Normal","Baja","A",2.2850000000000001]
[null,null,null,null,"Olocau del Rey",null,null,"Benissoda","46068","Valencia/Valéncia","La Vall d'Albaida",430,"No","Polivulnerabilidad baja","No","Baja","Media","Normal","-","A",4.04]
[null,null,null,null,"Onda",null,null,"Benissuera","46069","Valencia/Valéncia","La Vall d'Albaida",194,"No","Polivulnerabilidad baja","No","Media","Alta","Normal","-","A",2.1190000000000002]
[null,null,null,null,"Ondara",null,null,"Bétera","46070","Valencia/Valéncia","El Camp de Túria",24272,"No","Vulnerabilidad residual","No","Media","Media","Alto","Media","C-2",75.096000000000004]
[null,null,null,null,"Onil",null,null,"Bicorp","46071","Valencia/Valéncia","La Canal de Navarrés",533,"Si","Polivulnerabilidad media","Si","Media","Alta","Normal","Baja","A",136.50399999999999]
[null,null,null,null,"Ontinyent",null,null,"Bocairent","46072","Valencia/Valéncia","La Vall d'Albaida",4195,"No","Vulnerabilidad residual","No","Media","Alta","Normal","Alta","A",96.980999999999995]
[null,null,null,null,"Orba",null,null,"Bolbaite","46073","Valencia/Valéncia","La Canal de Navarrés",1356,"No","Polivulnerabilidad media","No","Alta","Media","Normal","Alta","A",40.387]
[null,null,null,null,"Orihuela",null,null,"Bonrepòs i Mirambell","46074","Valencia/Valéncia","L'Horta Nord",3691,"No","Polivulnerabilidad baja","No","Media","Media","Alto","-","C-2",1.0549999999999999]
[null,null,null,null,"Oropesa del Mar/Orpesa",null,null,"Bufali","46075","Valencia/Valéncia","La Vall d'Albaida",161,"No","Polivulnerabilidad baja","No","Baja","Alta","Normal","Baja","A",3.1920000000000002]
[null,null,null,null,"Orxeta",null,null,"Bugarra","46076","Valencia/Valéncia","Los Serranos",727,"Si","Polivulnerabilidad media","No","Media","Baja","Normal","-","A",40.308]
[null,null,null,null,"Otos",null,null,"Buñol","46077","Valencia/Valéncia","La Hoya de Buñol",9408,"No","Polivulnerabilidad media","Si","Media","Media","Normal","-","A",112.40300000000001]
[null,null,null,null,"Paiporta",null,null,"Burjassot","46078","Valencia/Valéncia","L'Horta Nord",38024,"No","Vulnerabilidad integral","Si","Media","Media","Alto","-","C-1",3.444]
[null,null,null,null,"Palanques",null,null,"Calles","46079","Valencia/Valéncia","Los Serranos",355,"Si","Polivulnerabilidad media","No","Alta","Media","Normal","Alta","A",64.921999999999997]
[null,null,null,null,"Palma de Gandía",null,null,"Camporrobles","46080","Valencia/Valéncia","La Plana de Utiel-Requena",1191,"Si","Polivulnerabilidad baja","No","Media","Baja","Normal","-","A",89.497]
[null,null,null,null,"Palmera",null,null,"Canals","46081","Valencia/Valéncia","La Costera",13587,"No","Polivulnerabilidad baja","No","Media","Alta","Normal","Media","A",21.86]
[null,null,null,null,"Palomar, el",null,null,"Canet d'En Berenguer","46082","Valencia/Valéncia","El Camp de Morvedre",6697,"No","Vulnerabilidad residual","No","Alta","Baja","Alto","Media","A",3.843]
[null,null,null,null,"Parcent",null,null,"Carcaixent","46083","Valencia/Valéncia","La Ribera Alta",20358,"No","Polivulnerabilidad baja","No","Alta","Alta","Normal","-","C-2",59.255000000000003]
[null,null,null,null,"Paterna",null,null,"Càrcer","46084","Valencia/Valéncia","La Ribera Alta",1862,"No","Polivulnerabilidad baja","No","Alta","Alta","Normal","-","A",7.4050000000000002]
[null,null,null,null,"Pavías",null,null,"Carlet","46085","Valencia/Valéncia","La Ribera Alta",15598,"No","Polivulnerabilidad media","Si","Alta","Alta","Normal","-","A",45.622]
[null,null,null,null,"Pedralba",null,null,"Carrícola","46086","Valencia/Valéncia","La Vall d'Albaida",94,"Si","Polivulnerabilidad baja","No","Baja","Media","Normal","Media","A",4.5990000000000002]
[null,null,null,null,"Pedreguer",null,null,"Casas Altas","46087","Valencia/Valéncia","El Rincón de Ademuz",131,"Si","Polivulnerabilidad media","No","Baja","Media","Normal","-","A",15.951000000000001]
[null,null,null,null,"Pego",null,null,"Casas Bajas","46088","Valencia/Valéncia","El Rincón de Ademuz",164,"Si","Polivulnerabilidad baja","No","Media","Baja","Normal","Baja","A",22.652999999999999]
[null,null,null,null,"Penàguila",null,null,"Casinos","46089","Valencia/Valéncia","El Camp de Túria",2777,"No","Polivulnerabilidad baja","No","Media","Baja","Normal","Alta","A",41.484000000000002]
[null,null,null,null,"Peníscola/Peñíscola",null,null,"Castelló de Rugat","46090","Valencia/Valéncia","La Vall d'Albaida",2274,"No","Polivulnerabilidad baja","No","Baja","Media","Normal","Baja","A",19.021999999999998]
[null,null,null,null,"Petrer",null,null,"Castellonet de la Conquesta","46091","Valencia/Valéncia","La Safor",147,"No","Vulnerabilidad residual","No","Baja","Alta","Normal","-","A",5.4329999999999998]
[null,null,null,null,"Petrés",null,null,"Castielfabib","46092","Valencia/Valéncia","El Rincón de Ademuz",317,"Si","Vulnerabilidad integral","Si","Baja","Baja","Normal","Alta","A",106.28700000000001]
[null,null,null,null,"Picanya",null,null,"Catadau","46093","Valencia/Valéncia","La Ribera Alta",2777,"No","Vulnerabilidad residual","No","Alta","Media","Normal","Media","A",35.457999999999998]
[null,null,null,null,"Picassent",null,null,"Catarroja","46094","Valencia/Valéncia","L'Horta Sud",28120,"No","Polivulnerabilidad baja","No","Alta","Media","Alto","-","C-1",13.157]
[null,null,null,null,"Pilar de la Horadada",null,null,"Caudete de las Fuentes","46095","Valencia/Valéncia","La Plana de Utiel-Requena",700,"No","Vulnerabilidad integral","Si","Media","Baja","Normal","-","A",34.598999999999997]
[null,null,null,null,"Piles",null,null,"Cerdà","46096","Valencia/Valéncia","La Costera",331,"No","Polivulnerabilidad baja","No","Baja","Alta","Normal","Alta","A",1.522]
[null,null,null,null,"Pina de Montalgrao",null,null,"Cofrentes","46097","Valencia/Valéncia","El Valle de Cofrentes-Ayora",1130,"Si","Vulnerabilidad residual","No","Media","Media","Normal","Alta","A",103.184]
[null,null,null,null,"Pinet",null,null,"Corbera","46098","Valencia/Valéncia","La Ribera Baixa",3100,"No","Polivulnerabilidad media","Si","Alta","Alta","Normal","-","A",20.27]
[null,null,null,null,"Pinós, el/Pinoso",null,null,"Cortes de Pallás","46099","Valencia/Valéncia","El Valle de Cofrentes-Ayora",814,"Si","Polivulnerabilidad baja","No","Media","Media","Normal","-","A",233.01300000000001]
[null,null,null,null,"Planes",null,null,"Cotes","46100","Valencia/Valéncia","La Ribera Alta",333,"No","Polivulnerabilidad baja","No","Alta","Alta","Normal","-","A",6.3259999999999996]
[null,null,null,null,"Pobla de Benifassà, la",null,null,"Quart de les Valls","46101","Valencia/Valéncia","El Camp de Morvedre",988,"No","Polivulnerabilidad media","Si","Media","Baja","Normal","Media","A",8.4269999999999996]
[null,null,null,null,"Pobla de Farnals, la",null,null,"Quart de Poblet","46102","Valencia/Valéncia","L'Horta Oest",24760,"No","Polivulnerabilidad media","Si","Media","Media","Alto","-","B",19.722000000000001]
[null,null,null,null,"Pobla de Vallbona, la",null,null,"Quartell","46103","Valencia/Valéncia","El Camp de Morvedre",1636,"No","Polivulnerabilidad baja","No","Alta","Baja","Normal","Alta","A",3.1779999999999999]
[null,null,null,null,"Pobla del Duc, la",null,null,"Quatretonda","46104","Valencia/Valéncia","La Vall d'Albaida",2212,"No","Vulnerabilidad residual","No","Alta","Alta","Normal","-","A",43.548999999999999]
[null,null,null,null,"Pobla Llarga, la",null,null,"Cullera","46105","Valencia/Valéncia","La Ribera Baixa",22145,"No","Polivulnerabilidad baja","No","Alta","Alta","Alto","Media","C-1",53.820999999999998]
[null,null,null,null,"Pobla Tornesa, la",null,null,"Chelva","46106","Valencia/Valéncia","Los Serranos",1489,"Si","Polivulnerabilidad media","Si","Media","Media","Normal","-","A",190.38200000000001]
[null,null,null,null,"Poblets, els",null,null,"Chella","46107","Valencia/Valéncia","La Canal de Navarrés",2435,"No","Vulnerabilidad integral","Si","Media","Alta","Normal","Baja","A",43.491999999999997]
[null,null,null,null,"Polinyà de Xúquer",null,null,"Chera","46108","Valencia/Valéncia","La Plana de Utiel-Requena",474,"Si","Polivulnerabilidad media","Si","Media","Baja","Normal","Media","A",49.697000000000003]
[null,null,null,null,"Polop",null,null,"Cheste","46109","Valencia/Valéncia","La Hoya de Buñol",8494,"No","Vulnerabilidad residual","No","Media","Media","Normal","Alta","A",71.441999999999993]
[null,null,null,null,"Portell de Morella",null,null,"Xirivella","46110","Valencia/Valéncia","L'Horta Oest",29623,"No","Vulnerabilidad integral","Si","Media","Media","Alto","Baja","B",5.13]
[null,null,null,null,"Potries",null,null,"Chiva","46111","Valencia/Valéncia","La Hoya de Buñol",15123,"No","Vulnerabilidad residual","No","Media","Baja","Normal","Alta","A",178.72900000000001]
[null,null,null,null,"Puçol",null,null,"Chulilla","46112","Valencia/Valéncia","Los Serranos",665,"Si","Polivulnerabilidad media","No","Media","Media","Normal","-","A",61.78]
[null,null,null,null,"Puebla de Arenoso",null,null,"Daimús","46113","Valencia/Valéncia","La Safor",3117,"No","Vulnerabilidad residual","No","Alta","Alta","Alto","Baja","A",3.1459999999999999]
[null,null,null,null,"Puebla de San Miguel",null,null,"Domeño","46114","Valencia/Valéncia","Los Serranos",708,"Si","Polivulnerabilidad baja","No","Alta","Baja","Normal","Baja","A",68.581999999999994]
[null,null,null,null,"Puig de Santa Maria, el",null,null,"Dos Aguas","46115","Valencia/Valéncia","La Hoya de Buñol",376,"Si","Polivulnerabilidad media","Si","Baja","Media","Normal","Alta","A",121.51]
[null,null,null,null,"Quart de les Valls",null,null,"Eliana, l'","46116","Valencia/Valéncia","El Camp de Túria",18235,"No","Vulnerabilidad residual","No","Media","Baja","Alto","Alta","C-2",8.7720000000000002]
[null,null,null,null,"Quart de Poblet",null,null,"Emperador","46117","Valencia/Valéncia","L'Horta Nord",687,"No","Polivulnerabilidad baja","No","Baja","Media","Alto","Baja","C-2",2.5999999999999999E-2]
[null,null,null,null,"Quartell",null,null,"Enguera","46118","Valencia/Valéncia","La Canal de Navarrés",4752,"No","Vulnerabilidad residual","No","Media","Media","Normal","-","A",241.749]
[null,null,null,null,"Quatretonda",null,null,"Ènova, l'","46119","Valencia/Valéncia","La Ribera Alta",887,"No","Polivulnerabilidad baja","No","Baja","Alta","Normal","Baja","A",7.6740000000000004]
[null,null,null,null,"Quatretondeta",null,null,"Estivella","46120","Valencia/Valéncia","El Camp de Morvedre",1456,"No","Vulnerabilidad residual","No","Media","Baja","Normal","-","A",20.917000000000002]
[null,null,null,null,"Quesa",null,null,"Estubeny","46121","Valencia/Valéncia","La Costera",121,"Si","Polivulnerabilidad baja","No","Baja","Alta","Normal","-","A",6.4180000000000001]
[null,null,null,null,"Rafal",null,null,"Faura","46122","Valencia/Valéncia","El Camp de Morvedre",3538,"No","Vulnerabilidad residual","No","Media","Baja","Normal","-","A",1.6359999999999999]
[null,null,null,null,"Rafelbunyol",null,null,"Favara","46123","Valencia/Valéncia","La Ribera Baixa",2518,"No","Vulnerabilidad residual","No","Alta","Alta","Normal","-","A",9.4540000000000006]
[null,null,null,null,"Rafelcofer",null,null,"Fontanars dels Alforins","46124","Valencia/Valéncia","La Vall d'Albaida",971,"No","Polivulnerabilidad baja","No","Baja","Media","Normal","Baja","A",74.688000000000002]
[null,null,null,null,"Rafelguaraf",null,null,"Fortaleny","46125","Valencia/Valéncia","La Ribera Baixa",1026,"No","Polivulnerabilidad baja","No","Alta","Alta","Normal","-","A",4.5679999999999996]
[null,null,null,null,"Ràfol d'Almúnia, el",null,null,"Foios","46126","Valencia/Valéncia","L'Horta Nord",7367,"No","Vulnerabilidad residual","No","Media","Media","Alto","-","C-1",6.48]
[null,null,null,null,"Ráfol de Salem",null,null,"Font d'En Carròs, la","46127","Valencia/Valéncia","La Safor",3794,"No","Vulnerabilidad residual","No","Alta","Alta","Normal","Alta","A",9.8979999999999997]
[null,null,null,null,"Real",null,null,"Font de la Figuera, la","46128","Valencia/Valéncia","La Costera",2038,"No","Vulnerabilidad residual","No","Baja","Media","Normal","-","A",84.335999999999999]
[null,null,null,null,"Real de Gandia, el",null,null,"Fuenterrobles","46129","Valencia/Valéncia","La Plana de Utiel-Requena",682,"No","Vulnerabilidad residual","No","Baja","Baja","Normal","-","A",49.453000000000003]
[null,null,null,null,"Redován",null,null,"Gavarda","46130","Valencia/Valéncia","La Ribera Alta",1038,"No","Polivulnerabilidad baja","No","Media","Alta","Normal","Baja","A",7.9870000000000001]
[null,null,null,null,"Relleu",null,null,"Gandia","46131","Valencia/Valéncia","La Safor",74562,"No","Polivulnerabilidad baja","No","Alta","Alta","Alto","Baja","B",60.835000000000001]
[null,null,null,null,"Requena",null,null,"Genovés, el","46132","Valencia/Valéncia","La Costera",2842,"No","Vulnerabilidad residual","No","Alta","Media","Normal","Alta","A",15.162000000000001]
[null,null,null,null,"Riba-roja de Túria",null,null,"Gestalgar","46133","Valencia/Valéncia","Los Serranos",556,"Si","Polivulnerabilidad baja","No","Alta","Baja","Normal","-","A",69.731999999999999]
[null,null,null,null,"Ribesalbes",null,null,"Gilet","46134","Valencia/Valéncia","El Camp de Morvedre",3324,"No","Vulnerabilidad residual","No","Media","Baja","Normal","Alta","A",11.282]
[null,null,null,null,"Riola",null,null,"Godella","46135","Valencia/Valéncia","L'Horta Nord",13088,"No","Vulnerabilidad residual","No","Media","Media","Alto","-","C-1",8.4030000000000005]
[null,null,null,null,"Rocafort",null,null,"Godelleta","46136","Valencia/Valéncia","La Hoya de Buñol",3533,"No","Vulnerabilidad residual","No","Media","Media","Normal","Baja","A",37.451000000000001]
[null,null,null,null,"Rojales",null,null,"Granja de la Costera, la","46137","Valencia/Valéncia","La Costera",285,"No","Vulnerabilidad residual","No","Baja","Alta","Normal","Baja","A",0.83099999999999996]
[null,null,null,null,"Romana, la",null,null,"Guadasséquies","46138","Valencia/Valéncia","La Vall d'Albaida",468,"No","Polivulnerabilidad baja","No","Baja","Media","Normal","-","A",3.26]
[null,null,null,null,"Rossell",null,null,"Guadassuar","46139","Valencia/Valéncia","La Ribera Alta",5893,"No","Polivulnerabilidad baja","No","Alta","Alta","Normal","Alta","A",35.340000000000003]
[null,null,null,null,"Rotglà i Corberà",null,null,"Guardamar de la Safor","46140","Valencia/Valéncia","La Safor",526,"No","Vulnerabilidad residual","No","Alta","Alta","Normal","Alta","A",1.099]
[null,null,null,null,"Rótova",null,null,"Higueruelas","46141","Valencia/Valéncia","Los Serranos",500,"Si","Vulnerabilidad residual","No","Media","Baja","Normal","-","A",18.797999999999998]
[null,null,null,null,"Rugat",null,null,"Jalance","46142","Valencia/Valéncia","El Valle de Cofrentes-Ayora",830,"Si","Polivulnerabilidad baja","No","Baja","Media","Normal","-","A",94.769000000000005]
[null,null,null,null,"Sacañet",null,null,"Xeraco","46143","Valencia/Valéncia","La Safor",5655,"No","Polivulnerabilidad baja","No","Alta","Media","Normal","Baja","A",20.216000000000001]
[null,null,null,null,"Sagra",null,null,"Jarafuel","46144","Valencia/Valéncia","El Valle de Cofrentes-Ayora",754,"Si","Vulnerabilidad integral","Si","Baja","Media","Normal","Alta","A",103.092]
[null,null,null,null,"Sagunto/Sagunt",null,null,"Xàtiva","46145","Valencia/Valéncia","La Costera",29231,"No","Vulnerabilidad residual","No","Baja","Alta","Normal","-","C-1",76.563999999999993]
[null,null,null,null,"Salem",null,null,"Xeresa","46146","Valencia/Valéncia","La Safor",2168,"No","Polivulnerabilidad baja","No","Alta","Media","Normal","Baja","A",16.846]
[null,null,null,null,"Salinas",null,null,"Llíria","46147","Valencia/Valéncia","El Camp de Túria",23253,"No","Vulnerabilidad residual","No","Media","Baja","Normal","-","A",227.977]
[null,null,null,null,"Salzadella, la",null,null,"Loriguilla","46148","Valencia/Valéncia","El Camp de Túria",2025,"No","Vulnerabilidad residual","No","Alta","Baja","Alto","-","C-1",72.421000000000006]
[null,null,null,null,"San Antonio de Benagéber",null,null,"Losa del Obispo","46149","Valencia/Valéncia","Los Serranos",507,"Si","Polivulnerabilidad media","No","Baja","Media","Normal","Alta","A",12.167]
[null,null,null,null,"San Fulgencio",null,null,"Llutxent","46150","Valencia/Valéncia","La Vall d'Albaida",2345,"No","Polivulnerabilidad baja","No","Media","Media","Normal","Baja","A",40.118000000000002]
[null,null,null,null,"San Isidro",null,null,"Llocnou d'En Fenollet","46151","Valencia/Valéncia","La Costera",916,"No","Vulnerabilidad residual","No","Baja","Media","Normal","Baja","A",1.532]
[null,null,null,null,"San Miguel de Salinas",null,null,"Llocnou de la Corona","46152","Valencia/Valéncia","L'Horta Sud",118,"Si","Vulnerabilidad integral","Si","Media","Alta","Alto","-","A",4.2000000000000003E-2]
[null,null,null,null,"San Rafael del Río",null,null,"Llocnou de Sant Jeroni","46153","Valencia/Valéncia","La Safor",546,"No","Vulnerabilidad residual","No","Alta","Alta","Normal","-","C-1",6.4729999999999999]
[null,null,null,null,"San Vicente del Raspeig/Sant Vicent del Raspeig",null,null,"Llanera de Ranes","46154","Valencia/Valéncia","La Costera",1055,"No","Polivulnerabilidad media","Si","Baja","Alta","Normal","-","A",9.2739999999999991]
[null,null,null,null,"Sanet y Negrals",null,null,"Llaurí","46155","Valencia/Valéncia","La Ribera Baixa",1170,"Si","Polivulnerabilidad media","Si","Alta","Alta","Normal","-","A",13.625999999999999]
[null,null,null,null,"Sant Joan d'Alacant",null,null,"Llombai","46156","Valencia/Valéncia","La Ribera Alta",2685,"No","Polivulnerabilidad baja","No","Media","Media","Normal","Media","A",55.575000000000003]
[null,null,null,null,"Sant Joan de Moró",null,null,"Llosa de Ranes, la","46157","Valencia/Valéncia","La Costera",3575,"No","Polivulnerabilidad baja","No","Media","Alta","Normal","-","A",7.1260000000000003]
[null,null,null,null,"Sant Joanet",null,null,"Macastre","46158","Valencia/Valéncia","La Hoya de Buñol",1283,"No","Polivulnerabilidad baja","No","Media","Media","Alto","-","A",37.655000000000001]
[null,null,null,null,"Sant Jordi/San Jorge",null,null,"Manises","46159","Valencia/Valéncia","L'Horta Oest",30919,"No","Polivulnerabilidad baja","No","Alta","Media","Alto","-","A",19.652999999999999]
[null,null,null,null,"Sant Mateu",null,null,"Manuel","46160","Valencia/Valéncia","La Ribera Alta",2428,"No","Vulnerabilidad residual","No","Alta","Alta","Alto","Media","B",6.048]
[null,null,null,null,"Santa Magdalena de Pulpis",null,null,"Marines","46161","Valencia/Valéncia","El Camp de Túria",1828,"No","Vulnerabilidad residual","No","Baja","Baja","Normal","-","A",35.722999999999999]
[null,null,null,null,"Santa Pola",null,null,"Massalavés","46162","Valencia/Valéncia","La Ribera Alta",1596,"No","Vulnerabilidad integral","Si","Baja","Alta","Normal","-","A",7.484]
[null,null,null,null,"Sax",null,null,"Massalfassar","46163","Valencia/Valéncia","L'Horta Nord",2469,"No","Vulnerabilidad residual","No","Media","Media","Alto","-","A",2.5339999999999998]
[null,null,null,null,"Sedaví",null,null,"Massamagrell","46164","Valencia/Valéncia","L'Horta Nord",15952,"No","Polivulnerabilidad baja","No","Alta","Media","Alto","-","C-2",6.1630000000000003]
[null,null,null,null,"Segart",null,null,"Massanassa","46165","Valencia/Valéncia","L'Horta Sud",9667,"No","Vulnerabilidad residual","No","Alta","Media","Alto","-","C-2",5.5919999999999996]
[null,null,null,null,"Segorbe",null,null,"Meliana","46166","Valencia/Valéncia","L'Horta Nord",10822,"No","Vulnerabilidad residual","No","Baja","Media","Alto","Baja","C-2",4.7329999999999997]
[null,null,null,null,"Sella",null,null,"Millares","46167","Valencia/Valéncia","La Canal de Navarrés",345,"Si","Polivulnerabilidad media","Si","Baja","Alta","Normal","-","C-1",105.50700000000001]
[null,null,null,null,"Sellent",null,null,"Miramar","46168","Valencia/Valéncia","La Safor",2634,"No","Vulnerabilidad residual","No","Alta","Alta","Normal","Media","A",2.556]
[null,null,null,null,"Sempere",null,null,"Mislata","46169","Valencia/Valéncia","L'Horta Oest",43691,"No","Vulnerabilidad residual","No","Baja","Media","Alto","Baja","A",2.032]
[null,null,null,null,"Senija",null,null,"Mogente/Moixent","46170","Valencia/Valéncia","La Costera",4302,"No","Polivulnerabilidad baja","No","Alta","Media","Normal","-","B",150.22800000000001]
[null,null,null,null,"Senyera",null,null,"Moncada","46171","Valencia/Valéncia","L'Horta Nord",21935,"No","Polivulnerabilidad baja","No","Media","Media","Alto","Baja","A",15.827999999999999]
[null,null,null,null,"Serra",null,null,"Montserrat","46172","Valencia/Valéncia","La Ribera Alta",7878,"No","Vulnerabilidad residual","No","Baja","Media","Normal","Baja","C-1",45.575000000000003]
[null,null,null,null,"Serratella, la",null,null,"Montaverner","46173","Valencia/Valéncia","La Vall d'Albaida",1630,"No","Polivulnerabilidad baja","No","Media","Media","Normal","Baja","A",7.3979999999999997]
[null,null,null,null,"Sierra Engarcerán",null,null,"Montesa","46174","Valencia/Valéncia","La Costera",1164,"No","Polivulnerabilidad baja","No","Baja","Alta","Normal","Alta","A",48.113]
[null,null,null,null,"Siete Aguas",null,null,"Montitxelvo/Montichelvo","46175","Valencia/Valéncia","La Vall d'Albaida",584,"No","Polivulnerabilidad baja","No","Baja","Alta","Normal","Alta","A",8.1649999999999991]
[null,null,null,null,"Silla",null,null,"Montroi/Montroy","46176","Valencia/Valéncia","La Ribera Alta",2867,"No","Vulnerabilidad residual","No","Alta","Media","Normal","Media","A",31.390999999999998]
[null,null,null,null,"Simat de la Valldigna",null,null,"Museros","46177","Valencia/Valéncia","L'Horta Nord",6458,"No","Vulnerabilidad residual","No","Media","Media","Alto","-","A",12.454000000000001]
[null,null,null,null,"Sinarcas",null,null,"Nàquera/Náquera","46178","Valencia/Valéncia","El Camp de Túria",6577,"No","Vulnerabilidad residual","No","Media","Baja","Alto","Media","C-2",38.706000000000003]
[null,null,null,null,"Sollana",null,null,"Navarrés","46179","Valencia/Valéncia","La Canal de Navarrés",2968,"No","Polivulnerabilidad baja","No","Media","Media","Normal","-","A",47.039000000000001]
[null,null,null,null,"Soneja",null,null,"Novelé/Novetlè","46180","Valencia/Valéncia","La Costera",837,"No","Vulnerabilidad residual","No","Baja","Alta","Normal","Baja","A",1.472]
[null,null,null,null,"Sot de Chera",null,null,"Oliva","46181","Valencia/Valéncia","La Safor",25101,"No","Polivulnerabilidad baja","No","Alta","Media","Normal","Baja","A",59.929000000000002]
[null,null,null,null,"Sot de Ferrer",null,null,"Olocau","46182","Valencia/Valéncia","El Camp de Túria",1771,"No","Polivulnerabilidad baja","No","Media","Baja","Normal","-","C-1",37.396999999999998]
[null,null,null,null,"Sueca",null,null,"Olleria, l'","46183","Valencia/Valéncia","La Vall d'Albaida",8281,"No","Vulnerabilidad residual","No","Media","Alta","Normal","Baja","A",32.225000000000001]
[null,null,null,null,"Sueras/Suera",null,null,"Ontinyent","46184","Valencia/Valéncia","La Vall d'Albaida",35347,"No","Polivulnerabilidad baja","No","Alta","Alta","Normal","Media","A",125.43]
[null,null,null,null,"Sumacàrcer",null,null,"Otos","46185","Valencia/Valéncia","La Vall d'Albaida",434,"No","Polivulnerabilidad baja","No","Baja","Alta","Normal","-","C-1",11.068]
[null,null,null,null,"Tales",null,null,"Paiporta","46186","Valencia/Valéncia","L'Horta Sud",26088,"No","Vulnerabilidad residual","No","Alta","Media","Alto","-","A",3.9569999999999999]
[null,null,null,null,"Tàrbena",null,null,"Palma de Gandía","46187","Valencia/Valéncia","La Safor",1631,"No","Polivulnerabilidad baja","No","Alta","Alta","Normal","-","C-1",13.920999999999999]
[null,null,null,null,"Tavernes Blanques",null,null,"Palmera","46188","Valencia/Valéncia","La Safor",1024,"No","Vulnerabilidad residual","No","Alta","Media","Normal","Alta","A",0.97799999999999998]
[null,null,null,null,"Tavernes de la Valldigna",null,null,"Palomar, el","46189","Valencia/Valéncia","La Vall d'Albaida",590,"No","Vulnerabilidad residual","No","Baja","Alta","Normal","Media","A",7.758]
[null,null,null,null,"Teresa",null,null,"Paterna","46190","Valencia/Valéncia","L'Horta Oest",70195,"No","Vulnerabilidad residual","No","Media","Media","Alto","Alta","A",35.850999999999999]
[null,null,null,null,"Teresa de Cofrentes",null,null,"Pedralba","46191","Valencia/Valéncia","Los Serranos",2778,"Si","Polivulnerabilidad baja","No","Alta","Baja","Normal","Alta","B",58.845999999999997]
[null,null,null,null,"Terrateig",null,null,"Petrés","46192","Valencia/Valéncia","El Camp de Morvedre",997,"No","Vulnerabilidad residual","No","Baja","Baja","Normal","-","A",1.875]
[null,null,null,null,"Teulada",null,null,"Picanya","46193","Valencia/Valéncia","L'Horta Oest",11513,"No","Vulnerabilidad residual","No","Alta","Media","Alto","-","A",7.1989999999999998]
[null,null,null,null,"Tibi",null,null,"Picassent","46194","Valencia/Valéncia","L'Horta Sud",20942,"No","Vulnerabilidad residual","No","Media","Media","Alto","Baja","B",85.786000000000001]
[null,null,null,null,"Tírig",null,null,"Piles","46195","Valencia/Valéncia","La Safor",2685,"No","Polivulnerabilidad baja","No","Alta","Alta","Normal","Media","C-1",3.9409999999999998]
[null,null,null,null,"Titaguas",null,null,"Pinet","46196","Valencia/Valéncia","La Vall d'Albaida",157,"Si","Polivulnerabilidad media","Si","Baja","Alta","Normal","Media","A",11.888999999999999]
[null,null,null,null,"Todolella",null,null,"Polinyà de Xúquer","46197","Valencia/Valéncia","La Ribera Baixa",2472,"No","Polivulnerabilidad baja","No","Alta","Media","Normal","-","A",9.1769999999999996]
[null,null,null,null,"Toga",null,null,"Potries","46198","Valencia/Valéncia","La Safor",1046,"No","Polivulnerabilidad baja","No","Baja","Alta","Normal","-","A",3.0720000000000001]
[null,null,null,null,"Tollos",null,null,"Pobla de Farnals, la","46199","Valencia/Valéncia","L'Horta Nord",7978,"No","Vulnerabilidad residual","No","Alta","Media","Alto","-","A",3.6150000000000002]
[null,null,null,null,"Torás",null,null,"Pobla del Duc, la","46200","Valencia/Valéncia","La Vall d'Albaida",2543,"No","Vulnerabilidad residual","No","Baja","Media","Alto","-","C-2",18.869]
[null,null,null,null,"Tormos",null,null,"Puebla de San Miguel","46201","Valencia/Valéncia","El Rincón de Ademuz",62,"Si","Vulnerabilidad residual","No","Baja","Media","Normal","Baja","A",63.581000000000003]
[null,null,null,null,"Toro, El",null,null,"Pobla de Vallbona, la","46202","Valencia/Valéncia","El Camp de Túria",24433,"No","Vulnerabilidad residual","No","Media","Baja","Alto","Baja","A",33.103999999999999]
[null,null,null,null,"Torralba del Pinar",null,null,"Pobla Llarga, la","46203","Valencia/Valéncia","La Ribera Alta",4452,"No","Vulnerabilidad residual","No","Media","Alta","Normal","-","C-2",10.093]
[null,null,null,null,"Torre d'En Besora, la",null,null,"Puig de Santa Maria, el","46204","Valencia/Valéncia","L'Horta Nord",8630,"No","Vulnerabilidad residual","No","Alta","Media","Alto","-","A",26.827000000000002]
[null,null,null,null,"Torre d'en Doménec, la",null,null,"Puçol","46205","Valencia/Valéncia","L'Horta Nord",19495,"No","Vulnerabilidad residual","No","Alta","Media","Alto","-","C-1",18.059999999999999]
[null,null,null,null,"Torrebaja",null,null,"Quesa","46206","Valencia/Valéncia","La Canal de Navarrés",670,"Si","Polivulnerabilidad media","Si","Baja","Alta","Normal","-","C-1",73.159000000000006]
[null,null,null,null,"Torreblanca",null,null,"Rafelbunyol","46207","Valencia/Valéncia","L'Horta Nord",8941,"No","Polivulnerabilidad baja","No","Alta","Media","Alto","Media","A",4.1980000000000004]
[null,null,null,null,"Torrechiva",null,null,"Rafelcofer","46208","Valencia/Valéncia","La Safor",1345,"No","Vulnerabilidad residual","No","Alta","Alta","Normal","Media","C-2",2.0329999999999999]
[null,null,null,null,"Torrella",null,null,"Rafelguaraf","46209","Valencia/Valéncia","La Ribera Alta",2335,"No","Vulnerabilidad residual","No","Alta","Alta","Normal","-","A",16.262]
[null,null,null,null,"Torremanzanas/Torre de les Maçanes, la",null,null,"Ráfol de Salem","46210","Valencia/Valéncia","La Vall d'Albaida",462,"No","Polivulnerabilidad baja","No","Baja","Media","Normal","-","A",4.3250000000000002]
[null,null,null,null,"Torrent",null,null,"Real de Gandia, el","46211","Valencia/Valéncia","La Safor",2461,"No","Vulnerabilidad residual","No","Alta","Media","Normal","-","A",6.0720000000000001]
[null,null,null,null,"Torres Torres",null,null,"Real","46212","Valencia/Valéncia","La Ribera Alta",2154,"No","Polivulnerabilidad baja","No","Media","Media","Normal","Media","A",18.315000000000001]
[null,null,null,null,"Torrevieja",null,null,"Requena","46213","Valencia/Valéncia","La Plana de Utiel-Requena",20254,"No","Polivulnerabilidad baja","No","Media","Baja","Normal","Alta","A",814.20899999999995]
[null,null,null,null,"Tous",null,null,"Riba-roja de Túria","46214","Valencia/Valéncia","El Camp de Túria",22264,"No","Vulnerabilidad residual","No","Media","Media","Alto","Media","C-1",57.488]
[null,null,null,null,"Traiguera",null,null,"Riola","46215","Valencia/Valéncia","La Ribera Baixa",1759,"No","Polivulnerabilidad baja","No","Alta","Alta","Normal","-","C-2",5.59]
[null,null,null,null,"Tuéjar",null,null,"Rocafort","46216","Valencia/Valéncia","L'Horta Nord",7240,"No","Vulnerabilidad residual","No","Media","Media","Alto","Baja","A",2.3410000000000002]
[null,null,null,null,"Turís",null,null,"Rotglà i Corberà","46217","Valencia/Valéncia","La Costera",1138,"No","Vulnerabilidad residual","No","Media","Alta","Normal","Alta","C-1",6.2569999999999997]
[null,null,null,null,"Useras/Useres, les",null,null,"Rótova","46218","Valencia/Valéncia","La Safor",1294,"No","Polivulnerabilidad baja","No","Media","Media","Normal","Media","A",7.6559999999999997]
[null,null,null,null,"Utiel",null,null,"Rugat","46219","Valencia/Valéncia","La Vall d'Albaida",158,"No","Vulnerabilidad residual","No","Baja","Media","Normal","Alta","A",3.2040000000000002]
[null,null,null,null,"València",null,null,"Sagunto/Sagunt","46220","Valencia/Valéncia","El Camp de Morvedre",66140,"No","Polivulnerabilidad baja","No","Alta","Baja","Alto","Baja","A",132.37]
[null,null,null,null,"Vall d'Alba",null,null,"Salem","46221","Valencia/Valéncia","La Vall d'Albaida",424,"No","Vulnerabilidad residual","No","Media","Media","Normal","Baja","B",8.6050000000000004]
[null,null,null,null,"Vall d'Alcalà, la",null,null,"Sant Joanet","46222","Valencia/Valéncia","La Ribera Alta",504,"No","Polivulnerabilidad baja","No","Baja","Alta","Normal","-","A",1.8580000000000001]
[null,null,null,null,"Vall de Almonacid",null,null,"Sedaví","46223","Valencia/Valéncia","L'Horta Sud",10333,"No","Vulnerabilidad residual","No","Media","Media","Alto","Media","A",1.833]
[null,null,null,null,"Vall de Gallinera",null,null,"Segart","46224","Valencia/Valéncia","El Camp de Morvedre",163,"No","Vulnerabilidad residual","No","Media","Baja","Normal","-","B",6.6440000000000001]
[null,null,null,null,"Vall de Laguar, la",null,null,"Sellent","46225","Valencia/Valéncia","La Ribera Alta",389,"No","Vulnerabilidad residual","No","Alta","Alta","Normal","Alta","A",14.005000000000001]
[null,null,null,null,"Vall d'Ebo, la",null,null,"Sempere","46226","Valencia/Valéncia","La Vall d'Albaida",34,"Si","Polivulnerabilidad media","Si","Baja","Alta","Normal","Baja","A",3.8260000000000001]
[null,null,null,null,"Vall d'Uixó, la",null,null,"Senyera","46227","Valencia/Valéncia","La Ribera Alta",1136,"No","Vulnerabilidad residual","No","Alta","Alta","Normal","-","A",2.0310000000000001]
[null,null,null,null,"Vallada",null,null,"Serra","46228","Valencia/Valéncia","El Camp de Túria",3124,"No","Vulnerabilidad residual","No","Baja","Baja","Normal","Alta","A",57.295000000000002]
[null,null,null,null,"Vallanca",null,null,"Siete Aguas","46229","Valencia/Valéncia","La Hoya de Buñol",1154,"No","Vulnerabilidad residual","No","Media","Media","Normal","Alta","A",110.595]
[null,null,null,null,"Vallat",null,null,"Silla","46230","Valencia/Valéncia","L'Horta Sud",18771,"No","Polivulnerabilidad media","Si","Media","Media","Alto","-","A",25.018999999999998]
[null,null,null,null,"Vallés",null,null,"Simat de la Valldigna","46231","Valencia/Valéncia","La Safor",3329,"No","Polivulnerabilidad baja","No","Media","Alta","Alto","Baja","C-1",38.488]
[null,null,null,null,"Vallibona",null,null,"Sinarcas","46232","Valencia/Valéncia","La Plana de Utiel-Requena",1125,"No","Vulnerabilidad residual","No","Media","Baja","Normal","Baja","A",102.461]
[null,null,null,null,"Venta del Moro",null,null,"Sollana","46233","Valencia/Valéncia","La Ribera Baixa",4861,"No","Vulnerabilidad residual","No","Alta","Alta","Normal","-","A",39.22]
[null,null,null,null,"Verger, el",null,null,"Sot de Chera","46234","Valencia/Valéncia","Los Serranos",369,"Si","Vulnerabilidad residual","No","Alta","Baja","Normal","Media","A",38.750999999999998]
[null,null,null,null,"Vilafamés",null,null,"Sueca","46235","Valencia/Valéncia","La Ribera Baixa",27479,"No","Vulnerabilidad residual","No","Alta","Alta","Normal","-","A",92.516000000000005]
[null,null,null,null,"Vilafranca/Villafranca del Cid",null,null,"Sumacàrcer","46236","Valencia/Valéncia","La Ribera Alta",1096,"No","Polivulnerabilidad media","No","Alta","Alta","Normal","Media","C-1",20.09]
[null,null,null,null,"Vilallonga/Villalonga",null,null,"Tavernes Blanques","46237","Valencia/Valéncia","L'Horta Nord",9120,"No","Polivulnerabilidad baja","No","Media","Media","Alto","-","A",0.73599999999999999]
[null,null,null,null,"Vilamarxant",null,null,"Tavernes de la Valldigna","46238","Valencia/Valéncia","La Safor",17201,"No","Vulnerabilidad residual","No","Alta","Alta","Normal","-","C-1",49.232999999999997]
[null,null,null,null,"Vilanova d'Alcolea",null,null,"Teresa de Cofrentes","46239","Valencia/Valéncia","El Valle de Cofrentes-Ayora",636,"Si","Polivulnerabilidad media","Si","Baja","Media","Normal","-","A",110.804]
[null,null,null,null,"Vilar de Canes",null,null,"Terrateig","46240","Valencia/Valéncia","La Vall d'Albaida",278,"No","Polivulnerabilidad media","No","Media","Alta","Normal","Media","A",6.3159999999999998]
[null,null,null,null,"Vila-real",null,null,"Titaguas","46241","Valencia/Valéncia","Los Serranos",453,"Si","Vulnerabilidad residual","No","Baja","Media","Normal","Baja","A",63.213000000000001]
[null,null,null,null,"Vilavella, la",null,null,"Torrebaja","46242","Valencia/Valéncia","El Rincón de Ademuz",411,"Si","Polivulnerabilidad baja","No","Alta","Baja","Normal","Alta","A",4.7169999999999996]
[null,null,null,null,"Villahermosa del Río",null,null,"Torrella","46243","Valencia/Valéncia","La Costera",146,"No","Polivulnerabilidad media","Si","Baja","Alta","Normal","Alta","A",1.145]
[null,null,null,null,"Villajoyosa/Vila Joiosa, la",null,null,"Torrent","46244","Valencia/Valéncia","L'Horta Oest",82208,"No","Polivulnerabilidad media","Si","Media","Media","Alto","Alta","A",69.234999999999999]
[null,null,null,null,"Villamalur",null,null,"Torres Torres","46245","Valencia/Valéncia","El Camp de Morvedre",637,"No","Vulnerabilidad residual","No","Baja","Baja","Normal","Alta","B",11.772]
[null,null,null,null,"Villanueva de Castellón",null,null,"Tous","46246","Valencia/Valéncia","La Ribera Alta",1263,"No","Polivulnerabilidad baja","No","Alta","Alta","Normal","Alta","A",127.524]
[null,null,null,null,"Villanueva de Viver",null,null,"Tuéjar","46247","Valencia/Valéncia","Los Serranos",1116,"Si","Polivulnerabilidad baja","No","Media","Media","Normal","-","A",121.923]
[null,null,null,null,"Villar del Arzobispo",null,null,"Turís","46248","Valencia/Valéncia","La Ribera Alta",6646,"No","Vulnerabilidad residual","No","Baja","Media","Normal","-","A",80.504999999999995]
[null,null,null,null,"Villargordo del Cabriel",null,null,"Utiel","46249","Valencia/Valéncia","La Plana de Utiel-Requena",11531,"No","Polivulnerabilidad baja","No","Alta","Baja","Normal","-","A",236.91300000000001]
[null,null,null,null,"Villena",null,null,"València","46250","Valencia/Valéncia","València",794288,"No","Vulnerabilidad residual","No","Media","Media","Alto","Baja","A-1",139.315]
[null,null,null,null,"Villores",null,null,"Vallada","46251","Valencia/Valéncia","La Costera",3039,"No","Vulnerabilidad residual","No","Media","Alta","Normal","-","C-1",61.497]
[null,null,null,null,"Vinalesa",null,null,"Vallanca","46252","Valencia/Valéncia","El Rincón de Ademuz",139,"Si","Polivulnerabilidad media","Si","Baja","Baja","Normal","Alta","A",56.61]
[null,null,null,null,"Vinaròs",null,null,"Vallés","46253","Valencia/Valéncia","La Costera",157,"No","Polivulnerabilidad media","Si","Alta","Alta","Normal","-","A",1.2350000000000001]
[null,null,null,null,"Vistabella del Maestrat",null,null,"Venta del Moro","46254","Valencia/Valéncia","La Plana de Utiel-Requena",1207,"Si","Polivulnerabilidad media","Si","Media","Baja","Normal","-","A",272.58800000000002]
[null,null,null,null,"Viver",null,null,"Vilallonga/Villalonga","46255","Valencia/Valéncia","La Safor",4270,"No","Vulnerabilidad residual","No","Alta","Media","Normal","Alta","A",43.317999999999998]
[null,null,null,null,"Xaló",null,null,"Vilamarxant","46256","Valencia/Valéncia","El Camp de Túria",9717,"No","Vulnerabilidad residual","No","Media","Media","Normal","-","A",71.08]
[null,null,null,null,"Xàtiva",null,null,"Villanueva de Castellón","46257","Valencia/Valéncia","La Ribera Alta",7049,"No","Vulnerabilidad residual","No","Alta","Alta","Normal","-","A",20.303000000000001]
[null,null,null,null,"Xeraco",null,null,"Villar del Arzobispo","46258","Valencia/Valéncia","Los Serranos",3554,"Si","Polivulnerabilidad baja","No","Baja","Baja","Normal","-","A",40.704999999999998]
[null,null,null,null,"Xeresa",null,null,"Villargordo del Cabriel","46259","Valencia/Valéncia","La Plana de Utiel-Requena",589,"Si","Polivulnerabilidad baja","No","Baja","Baja","Normal","Media","A",71.61]
[null,null,null,null,"Xert",null,null,"Vinalesa","46260","Valencia/Valéncia","L'Horta Nord",3420,"No","Vulnerabilidad residual","No","Alta","Media","Alto","Alta","A",1.5289999999999999]
[null,null,null,null,"Xirivella",null,null,"Yátova","46261","Valencia/Valéncia","La Hoya de Buñol",2067,"No","Vulnerabilidad residual","No","Baja","Media","Normal","Baja","C-2",120.24]
[null,null,null,null,"Yátova",null,null,"Yesa, La","46262","Valencia/Valéncia","Los Serranos",229,"Si","Polivulnerabilidad baja","No","Baja","Baja","Normal","Media","A",84.674999999999997]
[null,null,null,null,"Yesa, La",null,null,"Zarra","46263","Valencia/Valéncia","El Valle de Cofrentes-Ayora",359,"Si","Polivulnerabilidad media","Si","Media","Media","Normal","-","A",49.718000000000004]
[null,null,null,null,"Zarra",null,null,"Gátova","46902","Valencia/Valéncia","El Camp de Túria",378,"Si","Polivulnerabilidad media","Si","Baja","Baja","Normal","Alta","A",30.411999999999999]
[null,null,null,null,"Zorita del Maestrazgo",null,null,"San Antonio de Benagéber","46903","Valencia/Valéncia","El Camp de Túria",9089,"No","Vulnerabilidad residual","No","Baja","Baja","Alto","Baja","C-2",8.7409999999999997]
[null,null,null,null,"Zucaina",null,null,"Benicull de Xúquer","46904","Valencia/Valéncia","La Ribera Baixa",1012,"No","Polivulnerabilidad baja","No","Alta",null,"Normal","-","A",3.4969999999999999]